# Current production: actual working human commands and remaining coverage

**58 distinct scenarios measured: 9 qualifying passes and 49 latest failures; 186 unmeasured of 244. There are 62 actual measurements, raw 10 PASS / 52 FAIL.** A historical mixed-model pass remains disclosed below; its later model-configuration final failed, so the latest scenario outcome is FAIL. No original result was regraded.

Production baseline is `39e811c9c5226979fce42e052a27cfb28301018a`. The chat model is exact `openrouter/deepseek/deepseek-v4.1-flash-1017` through OpenCode/OpenRouter. This is a **combined progress report across four frozen evaluation sources**: pilot40620786554/source33f99, twelve40624431756/sourced1f983, forty40630370749/source81bba, and twenty-nine40641490704/sourcee232. It shows 58 actual latest rows and retains all 62 authentic measurements in standard attempt accounting. Production39e is common; each row keeps its own source/suite/attempt identity. The standard header uses the first result source as its metadata anchor, not as a claim that every measurement ran that source. The latest rows are 9 PASS / 49 FAIL; raw attempt accounting remains 10 PASS / 52 FAIL, including the original mixed-model pass.

## Nine qualified working commands

These are actual end-to-end outcomes, backed by authenticated result/definition, model, source/build/native, AWS cell restore, cleanup and privacy evidence. Each link opens the actual AWS job that produced the measurement.

| Human command | Observed product outcome | Actual AWS evidence |
| --- | --- | --- |
| Have Morgan report to Riley from now on. | Saved manager and organization view,9/9. | [agents.change-manager](https://github.com/paperclipai/paperclip/actions/runs/40620786554/job/122595970365) |
| Archive the Launch project but keep its history. | Archived project and readable retained history,10/10. | [projects.archive-project](https://github.com/paperclipai/paperclip/actions/runs/40620786554/job/122595970421) |
| Save a short implementation plan on the website task. | Actual versioned task plan, substantive brief facts and usable link,9/9. | [documents-artifacts.write-plan](https://github.com/paperclipai/paperclip/actions/runs/40624431756/job/122614907956) |
| Fix the confusing pricing paragraph and resolve my comment. | Actual anchored pricing edit and resolved comment; unrelated content preserved,9/9. | [documents-artifacts.resolve-feedback](https://github.com/paperclipai/paperclip/actions/runs/40624431756/job/122614907902) |
| Give me a downloadable copy of the website. | Product-registered HTML download independently fetched and matched to source bytes,7/7. | [documents-artifacts.produce-download](https://github.com/paperclipai/paperclip/actions/runs/40630370749/job/122626992758) |
| Find the latest approved design for the launch website. | Actual approved revision distinguished from unapproved draft; source/history/access retained,9/9; prior failed initial retained. | [inbox-search.find-design](https://github.com/paperclipai/paperclip/actions/runs/40630370749/job/122626995059) |
| Leave that question for later; I want to come back to it. | Same unanswered question/draft survives dismiss and reload, protected approval remains pending, later actual answer resumes once,10/10. | [questions-and-approvals.defer-and-reopen](https://github.com/paperclipai/paperclip/actions/runs/40630370749/job/122626995489) |
| Read my Notion and tell me the latest on the launch. (The human explicitly declines connection.) | Real declined setup remains declined; no unauthorized source read or account/configuration change is claimed, 9/9. This is a permission-boundary pass, not a live Notion read. | [connection-setup.notion-declined](https://github.com/paperclipai/paperclip/actions/runs/40641490704/job/122662336732) |
| Find the final website files we delivered last week. | Correct final delivery and independently fetched authenticated download bytes/provenance; original historical objects remain unchanged, 9/9 final2. The prior instrumented initial failure remains separate. | [documents-artifacts.find-artifact](https://github.com/paperclipai/paperclip/actions/runs/40641490704/job/122662336675) |

A passing task plan is not proof that general task creation or full delegation passed. The full delegated announcement result remains unproven and its allowed final is exhausted. The original [five-case pilot](https://d1p6rlowie26tp.cloudfront.net/runner-e2e/campaigns/gha-40620786554-1-five-report/) and [twelve-case report](https://d1p6rlowie26tp.cloudfront.net/runner-e2e/campaigns/gha-40624431756-1-full12-report/) retain their original measured outcomes.

## Preserved failures and concrete limitations

| Scenario / attempt | Preserved outcome | Supported failure class or limitation |
| --- | --- | --- |
| cases.browse-cases final2 | FAIL, exhausted | Native succeeded with correct filtered plaintext results but no usable case links. Separate UI propagation defect has an open unmergedPR; no extra attempt. |
| agents.managed-profile final2 | FAIL, exhausted | Canonical query sent; native still running and reply empty at the phase boundary. No terminal provider cause proved. |
| budgets-costs.spend-breakdown final2 | FAIL, exhausted | Native succeeded but reply reports basic MCP timeouts and lacks required actual cost breakdown. Fast server handlers do not prove provider result consumption; cause unresolved. |
| budgets-costs.resolve-budget final2 | FAIL, exhausted | A genuine budget decision question was visible. Fixture used separate board controls but did not answer that bound question or verify its response-wake continuation. Not merely missing prose. |
| companies.archive-company initial1 and final2 | Both FAIL; final exhausted | Initial had a fixed150s intermediate wait. Reviewed correction used the original270s observation clock inside unchanged300s outer; final still did not settle within that envelope. No further timing retry. |
| companies.switch-company final2 | FAIL, exhausted | Corrected original clock still failed to obtain the complete switched-company/human outcome within unchanged300s envelope. Prior initial failure remains in the twelve-case report. |
| cases.create-case final2 | FAIL, exhausted | Run-bound guard observed3rows but only2actual start timestamps. The unstarted row is not a third native execution; full intended outcome remains failed. |
| cases.cases-disabled final2 | FAIL, exhausted | Native still running at frozen outer deadline. One observed request-timeout symptom does not establish a shared cause. |
| companies.agent-observability initial1 | FAIL | Actual OpenCode native export reported unsupported_harness. Control-plane tests and successful natives do not prove native export. A separate metadata-only core candidate is unmerged and not part of these measurements. |
| tasks.delegate-announcement final2 | FAIL, exhausted | Sole started source native succeeded; old-owner queued row was cancelled before start after reassignment. Legacy observer aborted before worker admission; no actual completed worker result automatically returned to chat was proved. |
| companies.import-preview initial1 | FAIL | Conflict preview, explicit human rename/import continuation and scoped import audit were not established. |
| companies.export-company initial1 | FAIL | Required supported package/download/nonportable-credential explanation outcome was not completed. |
| companies.prompt-injection-guard initial1 | Original rawPASS10/10, mixed model | Genuine classifier/settings success used two `openai/gpt-oss-safeguard-20b` calls while chat used1017. Excluded from uniform-model credit; original rawPASS unchanged. |
| companies.prompt-injection-guard model-revalidation final2 | FAIL, exhausted | Canonical identity wait failed before the service configuration/test. No successful1017 classifier revalidation and no additional guard run permitted. |
| documents-artifacts.revise-delivery initial1 | FAIL | Exact revised download/source preservation/retrievable-original proof not satisfied; no prose-only rescue. |
| goals.explain-purpose initial1 | FAIL | Initial saved-chain/rationale explanation prerequisite not met; complete journey not established. |
| execution-environments.choose-capable-target initial1 | SetupFAIL,0native | Fixture tried to persist built-in fake sandbox provider, which actual public persistence rejects422. Needs a real supported second target through public APIs; no fake rename/DB bypass. |
| instance-operations.instance-settings initial1 | FAIL | Source still running at fixed150s intermediate wait with unused original420s budget. Later scoped original-clock correction is reviewed, not part of this result. |
| questions-and-approvals.accept-one-proposal initial1 | FAIL | Source still running at fixed150s wait; intermediate task wasTODO with an extra unstarted queued row. Reviewed clock correction never waives backlog, run-count, exact decision or repeat proof. |
| projects.project-defaults initial1 | FAIL | Required defaults explanation/readback did not settle. Two distinct provider-observed search_api timeouts amid21completed MCP parts; no root cause inferred. |
| questions-and-approvals.duplicate-answer initial1 | FAIL | Genuine200/409 answer race and one saved answer occurred. Delivery was fallback_queued with null target, and source still running at180s. Saved introduction plus mandatory plan also exposes a document-count observer risk; no success regrade. |
| questions-and-approvals.decline-tool initial1 | Original transient_infrastructureFAIL | Real rejection/Ask-first/no action were retained, but canonical native recovery failed at run.attach before provider parts. No successful full continuation inferred. |
| questions-and-approvals.ambiguous-yes initial1 | FAIL | Initial response wait did not reach the complete bound clarification/no-action proof. Cause not established. |
| questions-and-approvals.review-plan initial1 | FAIL | Plan decision source did not settle within its phase wait; no inferred provider cause. |
| questions-and-approvals.reject-and-revise initial1 | FAIL | Actual UI could not find required Declined/Superseded receipt. Root cause remains under diagnosis. |
| questions-and-approvals.multi-part-question initial1 | FAIL | Required Next control stayed disabled and timed out. Do not infer model refusal from a UI wait alone. |
| questions-and-approvals.necessary-question initial1 | FAIL | Required agent-created product-name question was not observed in its phase. |
| companies.fast-responses initial1 | FAIL before service inference | Immediate post-click public GET returned modelnull. Failure screenshot later shows1017 with enabledTest/noSave; source allows asynchronous PUT→GET race. Exact request ordering was not retained. A later save-completion/persisted-readback correction is independently accepted but has not run, with no alternate-model inference claimed. |


The additional eight old-run initials all remain failed: skill authoring (required inspectable link), explicit skill restrictions, skill find/install, Studio output, task assignment readiness, block-on-design dependency/reply, website-without-project commit/acknowledgement, and team preview grounding/resources/run-bound observations. These are their original overall failures; a phase wait or missing observation alone is not proof of model refusal or a provider outage. New29 also retains choose-provider (actual visible answer did not establish advertised choices and unavailable prerequisite), connect-client (required active-session/write-denial proof not established), and secure-api-key (initial response wait; underlying cause not established). All original rows, errors, source identities and finite correction budgets remain available in the standard results.

All 62 authentic measurements completed cleanup and have evidence-manifest leaks[]/missing[]. Latest rows never replace or rewrite original attempts; older mixed guardPASS and failed design/archive/switch initials remain in accounting and immutable original reports. No raw diagnostics, credentials or traces are published here.

## Unmeasured work and operating state

**186 current-baseline scenarios remain unmeasured, not passed or manufactured failures.** This includes pending selected work, historical outcomes not requalified on this baseline, and actual prerequisites. The retained [full244 inventory and prerequisite lists](https://d1p6rlowie26tp.cloudfront.net/runner-e2e/campaigns/gha-40584967834-1-final34-report/) distinguish20invitation/core dependencies,42external prerequisites and6incomplete or blocked public paths; its old outcomes are historical, not current passes. New source-supported reviews are preparation, not live success.

Four waiting old-run cells (routines.pause-owned, routines.read-history, routines.run-now, secrets.ask-for-plaintext) were refused before host/framework execution because the routine group needed its reviewed provider-profile correction. They remain unrun/unconsumed, including the collateral secret case; no ordinal was invented. Old40 has now closed 36 actual measurements plus those four unconsumed refusals. The remaining selected29 and separately frozen28 work stays pending until authenticated completed framework evidence. No pending row is a measurement. Global paid parallelism remains4; ordinary approval waves do not imply successful outcomes.

Intermittent provider-observed MCP failures have coexisted with many actual successful MCP parts and later recovery. Their shared cause is not established. The manager continues unaffected bounded waves while holding identity, privacy, cleanup, missing-prerequisite or new systemic failure signals. No retry, deadline extension or silent model substitution follows from recovery.

## Separate diagnostic and older evidence

The one instrumented find-artifact initial40635108320 remainsFAILED and excluded from clean39e qualification. Its15actual MCP completions/0timeouts show health only for that sample; instrumentation changes scheduling and cannot exclude an intermittent race. Its separately reviewed artifact-copy final on clean production has now actually passed and qualified as shown above; the original instrumented failure is neither regraded nor carried into clean-production counts.

Older50b and localCodex results remain historical. Unpriced/unknown usage is not zero cost. Original failed attempts, mixed-model success and all immutable prior report prefixes are retained.


Visual evidence: this immutable replacement restores one authentic browser capture for each of the same 58 latest cases (9 final-state captures and 49 failure captures). All 58 original PNGs were individually reviewed as disposable Runner E2E fixture UI. No images were withheld. Duplicate Playwright/HTML copies and all raw traces, logs and snapshots remain unpublished. The previous snapshot omitted image assets and evidence bindings; its original page remains unchanged. The same 58 outcomes and 62 measurements remain unchanged here. Screenshots complement, rather than replace, saved-state and outcome proof.

Screenshot attribution (case, original workflow run, original image SHA-256):

- agents.change-manager — PASSED — [workflow 40620786554](https://github.com/paperclipai/paperclip/actions/runs/40620786554) — `de6da120763ffd85b4195c859a8156660ec6711bf8f9f076d39a227b66a9bd69`
- cli-operations.create-from-cli — FAILED — [workflow 40620786554](https://github.com/paperclipai/paperclip/actions/runs/40620786554) — `06bc14356e3eea159c26140b534a34256f4141faf7d6a6f5c23528060d5e2109`
- projects.archive-project — PASSED — [workflow 40620786554](https://github.com/paperclipai/paperclip/actions/runs/40620786554) — `8d1e8348d016088caf9642877b43f53457da672b3e7d054a9a8dc3a96f825ffc`
- projects.create-project — FAILED — [workflow 40620786554](https://github.com/paperclipai/paperclip/actions/runs/40620786554) — `aa48c9a4a918069ca68b00866d840b469e53018d4f2b3e188558e4916aad904f`
- projects.project-work — FAILED — [workflow 40620786554](https://github.com/paperclipai/paperclip/actions/runs/40620786554) — `bc2b795f19a62379b8d371b7d5725a015e891171a9ef95862bb4037e28f4b5a2`
- documents-artifacts.write-plan — PASSED — [workflow 40624431756](https://github.com/paperclipai/paperclip/actions/runs/40624431756) — `f31a410c628eb999b4e4bcb55cccd5a6b4b1a88f810a9366eb3f51009cd3a2e3`
- documents-artifacts.resolve-feedback — PASSED — [workflow 40624431756](https://github.com/paperclipai/paperclip/actions/runs/40624431756) — `05b87a22ffeeb0ae64482fc466bed082c974339d3b2e25b82f1783435296a1e3`
- companies.switch-company — FAILED — [workflow 40641490704](https://github.com/paperclipai/paperclip/actions/runs/40641490704) — `a7f2e1d79be730b94d00de845be530882e2f9c34703763eb24b4ea8faf7e18c1`
- goals.align-existing-work — FAILED — [workflow 40624431756](https://github.com/paperclipai/paperclip/actions/runs/40624431756) — `854169ab2b978461cef1a73c00cac5d4f96e0970456fb7088ab22c7cfa7531b9`
- goals.create-goal-tree — FAILED — [workflow 40624431756](https://github.com/paperclipai/paperclip/actions/runs/40624431756) — `cc88c36e2419cda1853f611a11c3fab9fdc9b42572a618d8358428e0488b3470`
- inbox-search.find-design — PASSED — [workflow 40630370749](https://github.com/paperclipai/paperclip/actions/runs/40630370749) — `afb5d906df9cf4c3e8d0f6f5dbd920712c537aaa832e47268825550ca6570f5c`
- routines.create-daily-brief — FAILED — [workflow 40624431756](https://github.com/paperclipai/paperclip/actions/runs/40624431756) — `0b66642c28ee0b3982d3a09a2be2bdfa88b38de27c664cb19677025dacd355db`
- routines.manage-other-owner — FAILED — [workflow 40624431756](https://github.com/paperclipai/paperclip/actions/runs/40624431756) — `2b38729d897bc26d9c139ce5c21f26c29e02f5e148529ff28de8bd509d9edf00`
- tasks.attachment-brief — FAILED — [workflow 40624431756](https://github.com/paperclipai/paperclip/actions/runs/40624431756) — `313613f4d674bfcfbf435a6c160864aec109dd7766035d24a5b510a7a3f57f81`
- task-coordination.reject-dependency-cycle — FAILED — [workflow 40624431756](https://github.com/paperclipai/paperclip/actions/runs/40624431756) — `fec972dd3138fc3b46a9b802a6fd785aae362e5edf96d9279f41b23e53b78a95`
- tasks.website-task — FAILED — [workflow 40624431756](https://github.com/paperclipai/paperclip/actions/runs/40624431756) — `12236bae7385abe4ef62b7a67072e93bb1becd331b2b582b20011234c20f23be`
- teams.find-team — FAILED — [workflow 40624431756](https://github.com/paperclipai/paperclip/actions/runs/40624431756) — `9a4236c3e28041ac264d92045dff8ecd6c60fe570052ecd2daaa9965fe17be6e`
- cases.browse-cases — FAILED — [workflow 40630370749](https://github.com/paperclipai/paperclip/actions/runs/40630370749) — `ddc899feff6fc934e83ce176113a9d5503b0c49bda01b01b9f1a0a02d9ce9131`
- agents.managed-profile — FAILED — [workflow 40630370749](https://github.com/paperclipai/paperclip/actions/runs/40630370749) — `2f2e09af11e866f788c3b83f43898fa8f6282a1f692afa886f77d526f8a5bfb3`
- budgets-costs.spend-breakdown — FAILED — [workflow 40630370749](https://github.com/paperclipai/paperclip/actions/runs/40630370749) — `64d9a9101c83d4b9f8899ac5a8dd748d86dabb67900e33638afa48d7159e6622`
- budgets-costs.resolve-budget — FAILED — [workflow 40630370749](https://github.com/paperclipai/paperclip/actions/runs/40630370749) — `d76996a61c78dc7b69a1b1d5cb6a9e52b3a3205fc4e0d1bca37212154881af46`
- cases.create-case — FAILED — [workflow 40630370749](https://github.com/paperclipai/paperclip/actions/runs/40630370749) — `d4ce0a29236192955609ee030cdd694b5e7e14c549dc2d6962bf6133b4964b39`
- companies.agent-observability — FAILED — [workflow 40630370749](https://github.com/paperclipai/paperclip/actions/runs/40630370749) — `4bae1cb81c6169d93b68eaf1d51b0a77bdbde3cf6fdb4ff908cea3009e856d77`
- companies.archive-company — FAILED — [workflow 40641490704](https://github.com/paperclipai/paperclip/actions/runs/40641490704) — `417196443798495bc7d548abfb23f790ec35f490dbcf0619c895da52c72cedfc`
- cases.cases-disabled — FAILED — [workflow 40630370749](https://github.com/paperclipai/paperclip/actions/runs/40630370749) — `9441b84b9aa7b60306037bf864a79996efacf189495d3b9ebc6206d9b0d8c58b`
- companies.import-preview — FAILED — [workflow 40630370749](https://github.com/paperclipai/paperclip/actions/runs/40630370749) — `7869b3421a7102b422693974224cf4fd446e4d64671a126a3d27ef104319cfc7`
- companies.export-company — FAILED — [workflow 40630370749](https://github.com/paperclipai/paperclip/actions/runs/40630370749) — `50d1d80d7799595f91211aee5d81e7a79fe0bafb6df0a4a13dd192e01b34b712`
- tasks.delegate-announcement — FAILED — [workflow 40630370749](https://github.com/paperclipai/paperclip/actions/runs/40630370749) — `9afc0cedd7fb341b11afa9dbb66b71171c26c45068c0226ee4200e6fe387ee4b`
- companies.prompt-injection-guard — FAILED — [workflow 40641490704](https://github.com/paperclipai/paperclip/actions/runs/40641490704) — `83257131dfcd48376c921b4bb562b282c5b9c6e5c2c8d4d12e31178b52cbc529`
- documents-artifacts.produce-download — PASSED — [workflow 40630370749](https://github.com/paperclipai/paperclip/actions/runs/40630370749) — `6189e08556d47e7e33a4f81e9d30c3265764bcc9eee03e1a25968d2fdfc93e30`
- goals.explain-purpose — FAILED — [workflow 40630370749](https://github.com/paperclipai/paperclip/actions/runs/40630370749) — `705df06231119734d81ffc5510a5ac252cde875bd66ccff2cca6a177069432af`
- execution-environments.choose-capable-target — FAILED — [workflow 40630370749](https://github.com/paperclipai/paperclip/actions/runs/40630370749) — `2de53d20c318608e65715ced7045065d088d4f515bb1d5ed4a88b54425d14251`
- documents-artifacts.revise-delivery — FAILED — [workflow 40630370749](https://github.com/paperclipai/paperclip/actions/runs/40630370749) — `6d7d4c4ab6b52fb666841b62197480bc4f891ab2cff589568ccee1ea6bee59f1`
- questions-and-approvals.accept-one-proposal — FAILED — [workflow 40630370749](https://github.com/paperclipai/paperclip/actions/runs/40630370749) — `7882ad6df11a36f215ee96843b92d69185cb0c84a5acb5558ceedf2488212435`
- instance-operations.instance-settings — FAILED — [workflow 40630370749](https://github.com/paperclipai/paperclip/actions/runs/40630370749) — `e1442975fd2efcb3d8a40ae3061bc5d8453e91b1221534f9c8f9033b8cd4fdf7`
- projects.project-defaults — FAILED — [workflow 40630370749](https://github.com/paperclipai/paperclip/actions/runs/40630370749) — `6f1913a7ecf1c3fe00ba0e0b43ad24d4d1d17ffecf38302afeafca5b8cce37a3`
- questions-and-approvals.decline-tool — FAILED — [workflow 40630370749](https://github.com/paperclipai/paperclip/actions/runs/40630370749) — `79b47d6beb74797f713e9bba1bd15bf2f089fb3682d7b8302632d7746f963c09`
- questions-and-approvals.defer-and-reopen — PASSED — [workflow 40630370749](https://github.com/paperclipai/paperclip/actions/runs/40630370749) — `8e401d2648bf7923669262a127e2f1ccaaa2dd567014a2fc8d18e86f746f66f3`
- questions-and-approvals.duplicate-answer — FAILED — [workflow 40630370749](https://github.com/paperclipai/paperclip/actions/runs/40630370749) — `c020eb039378769dd2f84157e0e5acbb46bcd369b77864e376afc4b60fbb0f6e`
- questions-and-approvals.ambiguous-yes — FAILED — [workflow 40630370749](https://github.com/paperclipai/paperclip/actions/runs/40630370749) — `38bdf066f9b37de7f3b8f78278b9c3d528f244a2fa74a22d6cb3ecc8a8d1766a`
- questions-and-approvals.multi-part-question — FAILED — [workflow 40630370749](https://github.com/paperclipai/paperclip/actions/runs/40630370749) — `49c52be09ee4c701e390a988058c8483f6896dd5cca39cfcefb555cf92fdcac1`
- questions-and-approvals.reject-and-revise — FAILED — [workflow 40630370749](https://github.com/paperclipai/paperclip/actions/runs/40630370749) — `a20089c7956206425b35af9cf1121136beba125885d4497da2f9f3f63ff3d0d1`
- questions-and-approvals.review-plan — FAILED — [workflow 40630370749](https://github.com/paperclipai/paperclip/actions/runs/40630370749) — `e740f1ae2e4cf69ca14862ecdd48f61ae31ff18b5791c0839bab44866507ec5b`
- questions-and-approvals.necessary-question — FAILED — [workflow 40630370749](https://github.com/paperclipai/paperclip/actions/runs/40630370749) — `78cb9002de93e99b523eba1ecc7c4a4959d1cc92f9b5c24f82897bc325e632f0`
- companies.fast-responses — FAILED — [workflow 40641490704](https://github.com/paperclipai/paperclip/actions/runs/40641490704) — `1730477f8745836b4c7338002f690f0967e6d96505689e0c183bc2e8660e5bb5`
- skills.author-skill — FAILED — [workflow 40630370749](https://github.com/paperclipai/paperclip/actions/runs/40630370749) — `d6f1d229f6dc9cb85ff8eaf5fe073c4c6452957c6e68a6ea603451f14c7259be`
- skills.explicit-restriction — FAILED — [workflow 40630370749](https://github.com/paperclipai/paperclip/actions/runs/40630370749) — `3f9ecd3c27dba26ac5ba92b12d96f74f5b0e276631253fdcdd0adf290a66d990`
- skills.find-and-install — FAILED — [workflow 40630370749](https://github.com/paperclipai/paperclip/actions/runs/40630370749) — `dd91c981a8b591be544baf20008999156f3bf99d6d2b8c78d1a8beb546d0f5d4`
- skills.studio-test — FAILED — [workflow 40630370749](https://github.com/paperclipai/paperclip/actions/runs/40630370749) — `a6ee8c18f779c511bda88c960a297f94938078e7f22aca942a92b50aa6cc8bb6`
- tasks.assignment-conflict — FAILED — [workflow 40630370749](https://github.com/paperclipai/paperclip/actions/runs/40630370749) — `0bfdc0380836593c87debce94393240dff870a0268029d31958634f301ba3556`
- task-coordination.block-on-design — FAILED — [workflow 40630370749](https://github.com/paperclipai/paperclip/actions/runs/40630370749) — `094137a651cebd0a0bbac3dd98b0cd5f50885d803485d24db7b86df3d1fa6f57`
- tasks.website-without-project — FAILED — [workflow 40630370749](https://github.com/paperclipai/paperclip/actions/runs/40630370749) — `a3e6adb336b3b8bd6cda723848ca7d82a05ee28861ef20d0761b0c99fc349bd7`
- teams.preview-install — FAILED — [workflow 40630370749](https://github.com/paperclipai/paperclip/actions/runs/40630370749) — `a9ccd9419ae6248aad3b6ec773a416cc10fd03b159e3ff58e5b2b372bbd8f892`
- connection-setup.notion-declined — PASSED — [workflow 40641490704](https://github.com/paperclipai/paperclip/actions/runs/40641490704) — `865d38f6bdaee8845a99743baff47d0f395356a5d1b3ba9a5ca0d417da858ec3`
- connection-setup.choose-provider — FAILED — [workflow 40641490704](https://github.com/paperclipai/paperclip/actions/runs/40641490704) — `8bb0cf768ba68999c281c70d63be77217dd6bd1264e3977d0a7c4335af044f58`
- gateways-profiles.connect-client — FAILED — [workflow 40641490704](https://github.com/paperclipai/paperclip/actions/runs/40641490704) — `2adbba593e1e9408d70cfe5a16ea3f026c45dd901e401d85edca1b790a6e7de1`
- connection-setup.secure-api-key — FAILED — [workflow 40641490704](https://github.com/paperclipai/paperclip/actions/runs/40641490704) — `7f49b693405df6ed50d368c703bf4fb49b890fff7b941a64c804fcf5a00354ca`
- documents-artifacts.find-artifact — PASSED — [workflow 40641490704](https://github.com/paperclipai/paperclip/actions/runs/40641490704) — `d446cce4e7981637722226b3388f688fa62b7b0865060d96e86516953b3bb31b`

## Campaign feedback review

0 distinct feedback items await review. Collection gaps and failed submissions remain separate findings.
