Full-stack acceptance campaign

Runner Full-Stack E2E

Results across runner profiles and execution environments. Declared PNG screenshots and normalized results are retained with every published campaign; additional diagnostic evidence remains in the access-controlled workflow artifact.

2026-10-28T05:53:11.817Z81bba1ddSource run ↗Campaign summary ↗

3/20Passed
17Failed
55m 44sSummed attempt time
Campaign notes and coverage
# Current production chat evaluation: completed twenty-case snapshot

**Coverage: 36 distinct scenarios measured / 6 qualifying passes / 29 latest failures / 1 mixed-model pass / 208 unmeasured.** The mixed-model pass is genuine product evidence but excluded from the requested uniform-DeepSeek threshold.

This is a partial snapshot of run [40630370749](https://github.com/paperclipai/paperclip/actions/runs/40630370749), source `81bba1dd0d4f77448bf4c5e360f3c78760e34ce2`, production baseline `39e811c9c5226979fce42e052a27cfb28301018a`. Exact configured model: `openrouter/deepseek/deepseek-v4.1-flash-1017` through OpenCode/OpenRouter.

## What actually works on the current production baseline

| Actual human request | Observed end-to-end state proof | Existing evidence page |
| --- | --- | --- |
| Have Morgan report to Riley from now on. | Saved manager change and organization view; relevant assignment and company invariants retained, 9/9 checks. | [Pilot](https://d1p6rlowie26tp.cloudfront.net/runner-e2e/campaigns/gha-40620786554-1-five-report/) |
| Archive the Launch project but keep its history. | Actual archived project with readable retained history, 10/10 checks. | [Pilot](https://d1p6rlowie26tp.cloudfront.net/runner-e2e/campaigns/gha-40620786554-1-five-report/) |
| Save a short implementation plan on the website task. | Versioned plan saved on the intended task, actual document link and substantive brief facts retained, 9/9 checks. | [Twelve-case report](https://d1p6rlowie26tp.cloudfront.net/runner-e2e/campaigns/gha-40624431756-1-full12-report/) |
| Fix the confusing pricing paragraph and resolve my comment. | Actual anchored document edit and correct annotation resolution, unrelated feedback preserved, 9/9 checks. | [Twelve-case report](https://d1p6rlowie26tp.cloudfront.net/runner-e2e/campaigns/gha-40624431756-1-full12-report/) |
| Give me a downloadable copy of the website. | Actual product-registered download independently opened and matched to produced bytes; source task retained, 7/7 checks. | Actual completed measurement in this campaign. |

| Find the latest approved design for the launch website. | Actual approved revision distinguished from the newer unapproved draft, with authenticated target/source/history and access proof, 9/9 checks; original failed initial retained. | Actual completed final measurement in this campaign. |

These six are measured passes on production39e. [The full 244-scenario coverage inventory and prerequisite lists](https://d1p6rlowie26tp.cloudfront.net/runner-e2e/campaigns/gha-40584967834-1-final34-report/) remain inspectable in the preceding historical report. Its old outcomes are historical, not extra current-baseline passes. Current measured outcomes and counts are below.

## First four final-correction outcomes

The first four selected final corrections all failed. Their original outcomes and prior attempts remain unchanged; these four final allowances are exhausted. All four completed cleanup and have evidence manifests with no leaks or missing files. At this snapshot twenty selected cells are measured and the remaining twenty await completed evidence. Root resumed normal bounded waves after the intermittent tool failures showed many successful MCP parts and later recovery; this does not establish their cause or universal transport health. Global paid parallelism remains four across operations. Queued jobs consume no scenario attempt. This snapshot does not establish a shared provider outage or transport cause.

| Scenario | Actual outcome and stage | Evidence-supported cause or limitation | Remaining correction |
| --- | --- | --- | --- |
| cases.browse-cases | FAIL; actual native succeeded | Correct C1/C2 plaintext results and excluded done C3, but the rendered reply had no usable case links. A separate UI propagation defect is being addressed; this result remains failed. | 0 |
| agents.managed-profile | FAIL; canonical query sent, native still running at phase deadline | Empty reply; no terminal error observed. No provider cause established. | 0 |
| budgets-costs.spend-breakdown | FAIL; main native succeeded | Reply reported repeated basic MCP request timeouts and did not supply the actual agent breakdown/incomplete-total outcome. Retained handler results exist; the delivery boundary/cause is unresolved. Warmup did not show the same markers. | 0 |
| budgets-costs.resolve-budget | FAIL; canonical query sent, native succeeded | A real bound budget question with a $10 choice was visible despite empty prose. The fixture used a separate board incident control without answering that question, so its intended question/response-wake continuation was not verified. Original final remains failed/exhausted. | 0 |

## Four additional completed outcomes

| Scenario | Original outcome / actual native evidence | Evidence-supported limitation | Remaining correction |
| --- | --- | --- | --- |
| companies.archive-company | FAILED initial; one actual started native, still running at phase deadline and cancelled during cleanup | Generic identity-response wait did not obtain the required archive/restore response; no terminal provider cause established. | 1 |
| cases.create-case | FAILED final; three recorded run rows, only two have actual start timestamps | Declared run-bound guard stopped the case. The unstarted queued row is not a third native execution. No partial result is promoted to pass. | 0 |
| companies.agent-observability | FAILED initial; two actual native runs succeeded | Actual native launch recorded agent_observability.unavailable with unsupported_harness: selected OpenCode trace export is not supported by the pinned export-launch contract. Both native runs succeeded, but the required export and later disable branch were not established. | 1 |
| cases.cases-disabled | FAILED final; one native remained running at the frozen outer deadline, then cleanup cancelled it | Required truthful availability/choice did not settle; one request-timeout marker was observed. That isolated symptom is not proof of a shared transport cause. | 0 |

The first eight originals retain FAILED status, cleanup passed, and manifests with no leaks or missing files. Cases run-row limits and actual native executions are distinct evidence. No timeout, queued row or partial semantic success is silently regraded.

## Four additional completed outcomes and model-policy boundary

| Scenario | Preserved original outcome | Evidence-supported interpretation | Remaining correction |
| --- | --- | --- | --- |
| companies.prompt-injection-guard | PASS 10/10; authenticated native/build/source and cleanup | Human settings configured the classifier; both actual fixed samples returned the expected verdict and recorded charges, while chat respected board-only management. **Mixed-model evidence:** chat used requested DeepSeek1017, but two classifier calls used `openai/gpt-oss-safeguard-20b`. Not qualifying uniform1017 credit. | One explicitly reviewed configuration correction may be admitted later; no raw result regrade. |
| companies.import-preview | FAILED initial | Required conflict preview, explicit human rename/import continuation and scoped import audit were not established. No unretained provider cause inferred. | 1 |
| companies.export-company | FAILED initial | Supported package, actual authorized download and nonportable-credential explanation did not satisfy the full outcome. | 1 |
| tasks.delegate-announcement | FAILED final; exhausted | Sole started native succeeded; a prior queued assignment row was cancelled before starting when the task was reassigned to Morgan. The legacy observer rejects cancelled rows and stopped before worker admission. This is not proof of a failed worker native or of the complete returned announcement. | 0 |

The mixed-model human request was **“Turn on the extra protection for suspicious app results and check that it works.”** Its successful settings/classifier result is disclosed as actual product behavior, while its auxiliary model configuration prevents uniform-model qualification. The product exposes a real editable Model input; any future correction must save the exact requested service model before actual tests, preserve their real verdict/security/UI proof, and receive its own explicit finite manifest accounting. Defaults and original measurement remain unchanged.

## Four further completed outcomes

| Scenario | Original outcome | Observed proof or limitation | Remaining correction |
| --- | --- | --- | --- |
| documents-artifacts.produce-download | PASS 7/7, qualified requested-model evidence | A real product-registered `website.html` download matched the produced source bytes, with source task and exact authenticated query-attachment identity retained. Actual source/build/native/cell-restore and cleanup/privacy verified. | No unchanged rerun requested. |
| documents-artifacts.revise-delivery | FAILED initial | Actual saved-source preservation, exact revised download and retrievable original did not satisfy the independent oracle, although revision-context wording passed. Cause remains under review; no result rescue from prose alone. | 1 |
| goals.explain-purpose | FAILED initial | Initial purpose/chain/rationale prerequisite was not accepted; later missing-association/private/read-only checks were not established. Full frozen journey was not completed. | 1 |
| execution-environments.choose-capable-target | FAILED initial, setup before native execution | Public environment creation returned 422; zero native runs. Source review proves the fixture tries to persist the built-in fake sandbox provider, which production reserves for internal probes. A genuine public second target is required; no fake provider rename or database bypass is permitted. Original response body was withheld. | 1 |

All four have cleanup passed, no evidence-manifest leaks or missing files, and no diagnostic privacy sidecar. The current 20-result snapshot contains three raw passes and seventeen original failures. Future fixture/oracle changes and unstarted queued cells are not new measured successes.

## Current baseline coverage

Across the five-case pilot, twelve initial journeys, and these twenty current-run measurements: **36 distinct scenarios measured: 6 qualifying passes, 29 latest failures, 1 mixed-model pass, 208 not measured**, totaling 244. There are **37 actual measurements**, with raw outcomes **7 PASS / 30 FAIL**. The design-search final repeats an already measured failed initial; both remain inspectable. Only six latest scenario outcomes meet the requested uniform-model threshold. Historical production/model lanes and the failed instrumented diagnostic remain separate.

Current qualifying passing scenarios are `agents.change-manager`, `projects.archive-project`, `documents-artifacts.write-plan`, `documents-artifacts.resolve-feedback`, `documents-artifacts.produce-download`, and `inbox-search.find-design`. A pass proves its actual tested human journey, not other unrun features.

Unmeasured includes the twenty cells of this manifest without completed imported evidence and other unrun journeys, explicit invitation/core dependencies, external prerequisites, and incomplete or blocked public paths. Pending operations and queued jobs consume no ordinal before actual framework evidence. The separately dispatched 29-case manifest has no imported measurements at this cutoff. No original measurement is regraded by this summary.

## Latest four completed outcomes

| Scenario | Preserved outcome and stage | Evidence-supported interpretation | Remaining correction |
| --- | --- | --- | --- |
| inbox-search.find-design | PASS final2, 9/9, qualified requested-model evidence | Actual approved revision and task link are distinguished from the unapproved revision; source, read-only history, access and same-run build/native proof verified. Original failed initial retained. | Final used; no unchanged rerun. |
| instance-operations.instance-settings | FAILED initial, canonical query sent | Native was still running with an empty reply at the fixed150s intermediate guidance wait. No terminal native error observed; required human configuration/route journey was not reached. Shared-clock correction is under source review, not applied to this result. | 1 |
| questions-and-approvals.accept-one-proposal | FAILED initial, canonical query sent | Source native remained running at the fixed150s initial wait. One additional task run row was queued without a start; it is not a second executed native. One provider-observed create_task timeout and seventeen completed MCP parts were retained; cause unresolved. Repeat/reload proof was not reached. | 1 |
| projects.project-defaults | FAILED initial, post-query settle wait | Required defaults explanation and selected public-state outcome did not settle. Two distinct provider-observed search_api timeouts and twenty-one completed MCP parts, including later successes, were retained. No shared outage or transport cause is proved. | 1 |

All twenty originals passed cleanup and have evidence manifests with no leaks or missing files. Recovered intermittent MCP symptoms may recur and remain monitored; identity, privacy, cleanup and prerequisite failures still stop affected admission. The frozen source and finite per-case bounds remain unchanged.

## Separate diagnostic evidence

The instrumented artifact-search initial in [40635108320](https://github.com/paperclipai/paperclip/actions/runs/40635108320) remains FAILED, with clean cleanup/privacy. Its retained timing showed 15 successful Paperclip MCP tool completions and no request timeout in that sample. This does not establish universal health or explain earlier failures. Its source/native build differs from clean production39e, so it supplies no clean-production pass credit. A narrow returned-copy observer/oracle correction has independently passed review and is included in a separately dispatched future final. The diagnostic failure remains unchanged; no final result has been imported.
Campaign usage and spend
0 / 0Complaints / suggestions · retained attempts0 distinct items · 20 attempts with incomplete collection · 0 failed submissions · 0 unresolved submissions
20Retained attempts0 missing attempts · 0 out-of-scope artifacts
2,037,927 (partial: 15/29 runs)Input tokens
82,557 (partial: 15/29 runs)Output tokens
10,672,678 (partial: 15/29 runs)Cached tokens
UnavailableLLM reported subtotal
$0.000000Daytona list estimate
96m 53sObserved attempt window20 retained attempts · 0 missing attempts

Attempt durations include setup and cleanup captured inside each attempt. The observed window spans the earliest retained start to the latest retained finish, including gaps and overlap. Carried-forward evidence can span older runs, so this window is not the current workflow's duration. Neither measure is CI queue/setup time or provider-billed runtime.

UnknownAgent execution time
0msDaytona lease time
0/29Runs provider-priced

Campaign costs include retained attempts, including failed retries. Result cards show the selected attempt. Provider-reported amounts and model estimates are separate; unpriced or unavailable runs are excluded, never counted as free. Coverage describes captured usage; unobserved setup, subscriptions, tools, CI and storage require additional accounting. Daytona runtime is a public-list-price estimate from captured lease time and pinned resources, before credits, discounts, storage allowance, or invoice adjustments. Local execution has no external runtime meter.

UnknownWorker setup time
UnknownWorker execution time
UnknownWorker feedback time
UnknownWorker cleanup time
UnknownWorker finalization time

0/20 complete worker receipts; 0 partial; 0 missing attempts. Worker phases cover the test callback through finalization before result publication. Browser/server startup, parent cleanup, CI queue/build time and provider-billed runtime are outside these measurements. An interrupted phase has no inferred end time.

Campaign feedback review

0 distinct feedback items await review. Collection gaps and failed submissions remain separate findings.

Full bodies and review rationale stay in private evidence. Exact duplicate bodies are grouped once; related causes can be linked by a reviewed duplicate disposition.

All results

Feature coverage 0 of 192 capabilities linked · 0 of 20 tests mapped

Associations use the current feature map. Counts describe linked test scenarios; a passing journey does not establish full coverage of a capability.

Getting started and access

FeatureCapabilities linkedLinked test results
Onboarding and first work 0/5 No mapped journey
Login, invitations, and access 0/5 No mapped journey
Companies and portability 0/8 No mapped journey

Tasks and conversations

FeatureCapabilities linkedLinked test results
Task creation and lifecycle 0/6 No mapped journey
Delegation, dependencies, and signoff 0/4 No mapped journey
Inbox, decisions, and search 0/5 No mapped journey
Agent conversations and project handoff 0/4 No mapped journey
Questions and approvals 0/8 No mapped journey
Steering and queued messages 0/7 No mapped journey
Documents, attachments, and work products 0/5 No mapped journey

Agents and reusable capabilities

FeatureCapabilities linkedLinked test results
Hiring, configuration, and organization 0/9 No mapped journey
Runs, harnesses, and model accounts 0/5 No mapped journey
Skills and Skill Studio 0/5 No mapped journey
Team packages and installation 0/4 No mapped journey

Projects and execution

FeatureCapabilities linkedLinked test results
Projects and repositories 0/5 No mapped journey
Goals and work alignment 0/3 No mapped journey
Workspaces, services, and files 0/5 No mapped journey
Execution environments 0/5 No mapped journey
Recovery 0/8 No mapped journey

Apps, channels, and extensions

FeatureCapabilities linkedLinked test results
Connection setup 0/8 No mapped journey
Assistant connections (MCP) 0/5 No mapped journey
App access and action permissions 0/5 No mapped journey
External chat and email 0/6 No mapped journey
Tool gateways and access profiles 0/5 No mapped journey
Secrets and proposals 0/5 No mapped journey
Plugins 0/4 No mapped journey

Automation and structured work

FeatureCapabilities linkedLinked test results
Routines, schedules, and triggers 0/5 No mapped journey
Cases 0/5 No mapped journey
Status cards 0/4 No mapped journey

Oversight and operation

FeatureCapabilities linkedLinked test results
Costs and budgets 0/6 No mapped journey
Dashboards and audit trails 0/6 No mapped journey
Navigation, profile, and announcements 0/6 No mapped journey
Instance operations 0/6 No mapped journey
CLI/API and local worktrees 0/6 No mapped journey

Contributor surfaces

FeatureCapabilities linkedLinked test results
Developer previews and diagnostic labs 0/4 No mapped journey

Test suite

Chat feature journeys

Executable catalog requests through Agent Chat, with independently graded persisted state.

Pass rate15.0%3/20 passed
Tokens12,793,162 (partial: 15/29 runs)2,037,927 (partial: 15/29 runs) input · 82,557 (partial: 15/29 runs) output
Known spendUnavailablereported LLM + model/runtime estimates estimate
Agent timeUnknown0ms lease
Execution20/200 retries · cleanup passed
Native OpenCode OpenRouter DeepSeek V4.1 Flash 1017Isolated localopencode · openrouter/deepseek/deepseek-v4.1-flash-1017
Overall failed · No behavioral checks recorded

transient infrastructure

Stopped waiting for chat scenario tasks.delegate-announcement: An observed provider run failed
Test detailsNo checks recorded · 3m 2s
Tokens89,619 (partial: 1/2 runs) in · 4,909 (partial: 1/2 runs) out449,536 (partial: 1/2 runs) cached · 1/2 runs covered
LLM spendUnavailable0/2 runs provider-priced
ExecutionLocal · not meteredUnknown agent

Worker phase timing: not captured.

Feedback was not captured for this attempt.

chat-features.runner-opencode.local.delegate-announcement
Attempt
1
Duration
3m 2s
Agent runtime
Unknown
Runtime
native
Provider
opencode
Model
openrouter/deepseek/deepseek-v4.1-flash-1017

No result artifact was uploaded

Startup reuse evidence
RunWarmthEnvironment/leaseWorkspaceRunnerProvider processProvider sessionProvider launches
fac09270-e206-40b9-ac67-4eff854972b2unknown unknown (evidence_missing)unknown (evidence_missing)unknown (evidence_missing)unknown (evidence_missing)unknown (evidence_missing) unknown
73dfa3e1-8373-453d-b304-eb267212bb51unknown unknown (evidence_missing)unknown (evidence_missing)unknown (evidence_missing)unknown (evidence_missing)unknown (evidence_missing) unknown

No matcher result was recorded.

Usage, billing and timing metadata
{
  "billing": {
    "llm": {
      "runCount": 2,
      "runsWithTokenUsage": 1,
      "runsWithReportedCost": 0,
      "runsWithEstimatedCost": 0,
      "runsWithPartialReportedCost": 0,
      "inputTokens": 89619,
      "outputTokens": 4909,
      "cachedInputTokens": 449536,
      "totalTokens": 544064,
      "reportedCostUsd": 0,
      "estimatedCostUsd": 0,
      "costStatus": "unpriced"
    },
    "runtime": {
      "provider": "local",
      "agentRunDurationMs": null,
      "leaseDurationMs": null,
      "leaseCount": 0,
      "costStatus": "not_metered",
      "costSource": "local_not_metered"
    },
    "reportedCostUsd": 0,
    "estimatedRuntimeCostUsd": 0,
    "observedAndEstimatedCostUsd": 0,
    "complete": false
  },
  "rawUsage": null,
  "workerTiming": null
}
Native OpenCode OpenRouter DeepSeek V4.1 Flash 1017Isolated localopencode · openrouter/deepseek/deepseek-v4.1-flash-1017
Overall failed · No behavioral checks recorded

candidate failure

Timed out waiting for initial identity response; the observed state did not satisfy the condition. See the saved state evidence.
Test detailsNo checks recorded · 2m 51s
TokensUnavailable in · Unavailable outUnavailable cached · 0/1 runs covered
LLM spendUnavailable0/1 runs provider-priced
ExecutionLocal · not metered2m 33s agent

Worker phase timing: not captured.

Feedback was not captured for this attempt.

chat-features.runner-opencode.local.agents.managed-profile
Attempt
1
Duration
2m 51s
Agent runtime
2m 33s
Runtime
native
Provider
opencode
Model
openrouter/deepseek/deepseek-v4.1-flash-1017

No result artifact was uploaded

Startup reuse evidence
RunWarmthEnvironment/leaseWorkspaceRunnerProvider processProvider sessionProvider launches
a86d7161-e197-4b1f-9cf2-231ee07c0c2aunknown unknown (evidence_missing)unknown (evidence_missing)unknown (evidence_missing)unknown (evidence_missing)unknown (evidence_missing) unknown

No matcher result was recorded.

Usage, billing and timing metadata
{
  "billing": {
    "llm": {
      "runCount": 1,
      "runsWithTokenUsage": 0,
      "runsWithReportedCost": 0,
      "runsWithEstimatedCost": 0,
      "runsWithPartialReportedCost": 0,
      "inputTokens": 0,
      "outputTokens": 0,
      "cachedInputTokens": 0,
      "totalTokens": 0,
      "reportedCostUsd": 0,
      "estimatedCostUsd": 0,
      "costStatus": "unavailable"
    },
    "runtime": {
      "provider": "local",
      "agentRunDurationMs": 152635,
      "leaseDurationMs": null,
      "leaseCount": 0,
      "costStatus": "not_metered",
      "costSource": "local_not_metered"
    },
    "reportedCostUsd": 0,
    "estimatedRuntimeCostUsd": 0,
    "observedAndEstimatedCostUsd": 0,
    "complete": false
  },
  "rawUsage": null,
  "workerTiming": null
}
Native OpenCode OpenRouter DeepSeek V4.1 Flash 1017Isolated localopencode · openrouter/deepseek/deepseek-v4.1-flash-1017
Overall failed · No behavioral checks recorded

candidate failure

Stopped waiting for budgets-costs.resolve-budget: Settled scenario failed: honest-incident-guidance
Test detailsNo checks recorded · 2m 45s
Tokens45,865 in · 3,539 out225,792 cached · 1/1 runs covered
LLM spendUnavailable0/1 runs provider-priced
ExecutionLocal · not metered1m 57s agent

Worker phase timing: not captured.

Feedback was not captured for this attempt.

chat-features.runner-opencode.local.budgets-costs.resolve-budget
Attempt
1
Duration
2m 45s
Agent runtime
1m 57s
Runtime
native
Provider
opencode
Model
openrouter/deepseek/deepseek-v4.1-flash-1017

No result artifact was uploaded

Startup reuse evidence
RunWarmthEnvironment/leaseWorkspaceRunnerProvider processProvider sessionProvider launches
064aba24-b851-4042-89c7-0b768ed9ba5dunknown unknown (evidence_missing)unknown (evidence_missing)unknown (evidence_missing)unknown (evidence_missing)unknown (evidence_missing) unknown

No matcher result was recorded.

Usage, billing and timing metadata
{
  "billing": {
    "llm": {
      "runCount": 1,
      "runsWithTokenUsage": 1,
      "runsWithReportedCost": 0,
      "runsWithEstimatedCost": 0,
      "runsWithPartialReportedCost": 0,
      "inputTokens": 45865,
      "outputTokens": 3539,
      "cachedInputTokens": 225792,
      "totalTokens": 275196,
      "reportedCostUsd": 0,
      "estimatedCostUsd": 0,
      "costStatus": "unpriced"
    },
    "runtime": {
      "provider": "local",
      "agentRunDurationMs": 116907,
      "leaseDurationMs": null,
      "leaseCount": 0,
      "costStatus": "not_metered",
      "costSource": "local_not_metered"
    },
    "reportedCostUsd": 0,
    "estimatedRuntimeCostUsd": 0,
    "observedAndEstimatedCostUsd": 0,
    "complete": false
  },
  "rawUsage": null,
  "workerTiming": null
}
Native OpenCode OpenRouter DeepSeek V4.1 Flash 1017Isolated localopencode · openrouter/deepseek/deepseek-v4.1-flash-1017
Overall failed · No behavioral checks recorded

candidate failure

Stopped waiting for budgets-costs.spend-breakdown: Settled scenario failed: actual-agent-breakdown-and-incomplete-total
Test detailsNo checks recorded · 8m 10s
Tokens128,741 in · 10,422 out510,065 cached · 2/2 runs covered
LLM spendUnavailable0/2 runs provider-priced
ExecutionLocal · not metered7m 22s agent

Worker phase timing: not captured.

Feedback was not captured for this attempt.

chat-features.runner-opencode.local.budgets-costs.spend-breakdown
Attempt
1
Duration
8m 10s
Agent runtime
7m 22s
Runtime
native
Provider
opencode
Model
openrouter/deepseek/deepseek-v4.1-flash-1017

No result artifact was uploaded

Startup reuse evidence
RunWarmthEnvironment/leaseWorkspaceRunnerProvider processProvider sessionProvider launches
77f094e2-09d7-44ae-a5e0-d0e302e2126aunknown unknown (evidence_missing)unknown (evidence_missing)unknown (evidence_missing)unknown (evidence_missing)unknown (evidence_missing) unknown
73289377-fa8e-40c3-84e9-d104583765f9unknown unknown (evidence_missing)unknown (evidence_missing)unknown (evidence_missing)unknown (evidence_missing)unknown (evidence_missing) unknown

No matcher result was recorded.

Usage, billing and timing metadata
{
  "billing": {
    "llm": {
      "runCount": 2,
      "runsWithTokenUsage": 2,
      "runsWithReportedCost": 0,
      "runsWithEstimatedCost": 0,
      "runsWithPartialReportedCost": 0,
      "inputTokens": 128741,
      "outputTokens": 10422,
      "cachedInputTokens": 510065,
      "totalTokens": 649228,
      "reportedCostUsd": 0,
      "estimatedCostUsd": 0,
      "costStatus": "unpriced"
    },
    "runtime": {
      "provider": "local",
      "agentRunDurationMs": 441924,
      "leaseDurationMs": null,
      "leaseCount": 0,
      "costStatus": "not_metered",
      "costSource": "local_not_metered"
    },
    "reportedCostUsd": 0,
    "estimatedRuntimeCostUsd": 0,
    "observedAndEstimatedCostUsd": 0,
    "complete": false
  },
  "rawUsage": null,
  "workerTiming": null
}
Native OpenCode OpenRouter DeepSeek V4.1 Flash 1017Isolated localopencode · openrouter/deepseek/deepseek-v4.1-flash-1017
Overall failed · No behavioral checks recorded

candidate failure

Stopped waiting for cases.browse-cases: Settled scenario failed: exact-filtered-case-results
Test detailsNo checks recorded · 1m 39s
Tokens56,807 in · 1,035 out228,992 cached · 1/1 runs covered
LLM spendUnavailable0/1 runs provider-priced
ExecutionLocal · not metered1m 4s agent

Worker phase timing: not captured.

Feedback was not captured for this attempt.

chat-features.runner-opencode.local.cases.browse-cases
Attempt
1
Duration
1m 39s
Agent runtime
1m 4s
Runtime
native
Provider
opencode
Model
openrouter/deepseek/deepseek-v4.1-flash-1017

No result artifact was uploaded

Startup reuse evidence
RunWarmthEnvironment/leaseWorkspaceRunnerProvider processProvider sessionProvider launches
83c76410-68d8-46c5-aa88-c64410530248unknown unknown (evidence_missing)unknown (evidence_missing)unknown (evidence_missing)unknown (evidence_missing)unknown (evidence_missing) unknown

No matcher result was recorded.

Usage, billing and timing metadata
{
  "billing": {
    "llm": {
      "runCount": 1,
      "runsWithTokenUsage": 1,
      "runsWithReportedCost": 0,
      "runsWithEstimatedCost": 0,
      "runsWithPartialReportedCost": 0,
      "inputTokens": 56807,
      "outputTokens": 1035,
      "cachedInputTokens": 228992,
      "totalTokens": 286834,
      "reportedCostUsd": 0,
      "estimatedCostUsd": 0,
      "costStatus": "unpriced"
    },
    "runtime": {
      "provider": "local",
      "agentRunDurationMs": 63589,
      "leaseDurationMs": null,
      "leaseCount": 0,
      "costStatus": "not_metered",
      "costSource": "local_not_metered"
    },
    "reportedCostUsd": 0,
    "estimatedRuntimeCostUsd": 0,
    "observedAndEstimatedCostUsd": 0,
    "complete": false
  },
  "rawUsage": null,
  "workerTiming": null
}
Native OpenCode OpenRouter DeepSeek V4.1 Flash 1017Isolated localopencode · openrouter/deepseek/deepseek-v4.1-flash-1017
Overall failed · No behavioral checks recorded

candidate failure

Timed out waiting for cases.cases-disabled; truthful-availability-and-choice, catalog-bounded-native-runs. See the saved state evidence.
Test detailsNo checks recorded · 4m 51s
TokensUnavailable in · Unavailable outUnavailable cached · 0/1 runs covered
LLM spendUnavailable0/1 runs provider-priced
ExecutionLocal · not metered4m 32s agent

Worker phase timing: not captured.

Feedback was not captured for this attempt.

chat-features.runner-opencode.local.cases.cases-disabled
Attempt
1
Duration
4m 51s
Agent runtime
4m 32s
Runtime
native
Provider
opencode
Model
openrouter/deepseek/deepseek-v4.1-flash-1017

No result artifact was uploaded

Startup reuse evidence
RunWarmthEnvironment/leaseWorkspaceRunnerProvider processProvider sessionProvider launches
144d8422-2c00-4c7d-a809-531989185bbbunknown unknown (evidence_missing)unknown (evidence_missing)unknown (evidence_missing)unknown (evidence_missing)unknown (evidence_missing) unknown

No matcher result was recorded.

Usage, billing and timing metadata
{
  "billing": {
    "llm": {
      "runCount": 1,
      "runsWithTokenUsage": 0,
      "runsWithReportedCost": 0,
      "runsWithEstimatedCost": 0,
      "runsWithPartialReportedCost": 0,
      "inputTokens": 137013,
      "outputTokens": 4748,
      "cachedInputTokens": 860160,
      "totalTokens": 1001921,
      "reportedCostUsd": 0,
      "estimatedCostUsd": 0,
      "costStatus": "unavailable"
    },
    "runtime": {
      "provider": "local",
      "agentRunDurationMs": 272355,
      "leaseDurationMs": null,
      "leaseCount": 0,
      "costStatus": "not_metered",
      "costSource": "local_not_metered"
    },
    "reportedCostUsd": 0,
    "estimatedRuntimeCostUsd": 0,
    "observedAndEstimatedCostUsd": 0,
    "complete": false
  },
  "rawUsage": null,
  "workerTiming": null
}
Native OpenCode OpenRouter DeepSeek V4.1 Flash 1017Isolated localopencode · openrouter/deepseek/deepseek-v4.1-flash-1017
Overall failed · No behavioral checks recorded

candidate failure

Stopped waiting for cases.create-case: Scenario exceeded its declared run bound
Test detailsNo checks recorded · 1m 55s
TokensUnavailable in · Unavailable outUnavailable cached · 0/3 runs covered
LLM spendUnavailable0/3 runs provider-priced
ExecutionLocal · not meteredUnknown agent

Worker phase timing: not captured.

Feedback was not captured for this attempt.

chat-features.runner-opencode.local.cases.create-case
Attempt
1
Duration
1m 55s
Agent runtime
Unknown
Runtime
native
Provider
opencode
Model
openrouter/deepseek/deepseek-v4.1-flash-1017

No result artifact was uploaded

Startup reuse evidence
RunWarmthEnvironment/leaseWorkspaceRunnerProvider processProvider sessionProvider launches
7bb43feb-e662-4c14-9aba-dbe91b6514e7unknown unknown (evidence_missing)unknown (evidence_missing)unknown (evidence_missing)unknown (evidence_missing)unknown (evidence_missing) unknown
978a19ad-d34f-4ec0-8243-b9a83e82561dunknown unknown (evidence_missing)unknown (evidence_missing)unknown (evidence_missing)unknown (evidence_missing)unknown (evidence_missing) unknown
b5d759b8-5396-4850-9c67-5a4a40ae6ce2unknown unknown (evidence_missing)unknown (evidence_missing)unknown (evidence_missing)unknown (evidence_missing)unknown (evidence_missing) unknown

No matcher result was recorded.

Usage, billing and timing metadata
{
  "billing": {
    "llm": {
      "runCount": 3,
      "runsWithTokenUsage": 0,
      "runsWithReportedCost": 0,
      "runsWithEstimatedCost": 0,
      "runsWithPartialReportedCost": 0,
      "inputTokens": 41987,
      "outputTokens": 3690,
      "cachedInputTokens": 501888,
      "totalTokens": 547565,
      "reportedCostUsd": 0,
      "estimatedCostUsd": 0,
      "costStatus": "unavailable"
    },
    "runtime": {
      "provider": "local",
      "agentRunDurationMs": null,
      "leaseDurationMs": null,
      "leaseCount": 0,
      "costStatus": "not_metered",
      "costSource": "local_not_metered"
    },
    "reportedCostUsd": 0,
    "estimatedRuntimeCostUsd": 0,
    "observedAndEstimatedCostUsd": 0,
    "complete": false
  },
  "rawUsage": null,
  "workerTiming": null
}
Native OpenCode OpenRouter DeepSeek V4.1 Flash 1017Isolated localopencode · openrouter/deepseek/deepseek-v4.1-flash-1017
Overall failed · No behavioral checks recorded

candidate failure

Timed out waiting for actual native harness trace export; the observed state did not satisfy the condition. See the saved state evidence.
Test detailsNo checks recorded · 3m 14s
Tokens248,835 in · 5,090 out444,928 cached · 2/2 runs covered
LLM spendUnavailable0/2 runs provider-priced
ExecutionLocal · not metered2m 9s agent

Worker phase timing: not captured.

Feedback was not captured for this attempt.

chat-features.runner-opencode.local.companies.agent-observability
Attempt
1
Duration
3m 14s
Agent runtime
2m 9s
Runtime
native
Provider
opencode
Model
openrouter/deepseek/deepseek-v4.1-flash-1017

No result artifact was uploaded

Startup reuse evidence
RunWarmthEnvironment/leaseWorkspaceRunnerProvider processProvider sessionProvider launches
28ede845-4260-4131-b9e6-e00ce79a4cb3unknown unknown (evidence_missing)unknown (evidence_missing)unknown (evidence_missing)unknown (evidence_missing)unknown (evidence_missing) unknown
de0e05b8-c9fe-40df-b87d-3d54d96654d0unknown unknown (evidence_missing)unknown (evidence_missing)unknown (evidence_missing)unknown (evidence_missing)unknown (evidence_missing) unknown

No matcher result was recorded.

Usage, billing and timing metadata
{
  "billing": {
    "llm": {
      "runCount": 2,
      "runsWithTokenUsage": 2,
      "runsWithReportedCost": 0,
      "runsWithEstimatedCost": 0,
      "runsWithPartialReportedCost": 0,
      "inputTokens": 248835,
      "outputTokens": 5090,
      "cachedInputTokens": 444928,
      "totalTokens": 698853,
      "reportedCostUsd": 0,
      "estimatedCostUsd": 0,
      "costStatus": "unpriced"
    },
    "runtime": {
      "provider": "local",
      "agentRunDurationMs": 129321,
      "leaseDurationMs": null,
      "leaseCount": 0,
      "costStatus": "not_metered",
      "costSource": "local_not_metered"
    },
    "reportedCostUsd": 0,
    "estimatedRuntimeCostUsd": 0,
    "observedAndEstimatedCostUsd": 0,
    "complete": false
  },
  "rawUsage": null,
  "workerTiming": null
}
Native OpenCode OpenRouter DeepSeek V4.1 Flash 1017Isolated localopencode · openrouter/deepseek/deepseek-v4.1-flash-1017
Overall failed · No behavioral checks recorded

candidate failure

Timed out waiting for initial identity response; the observed state did not satisfy the condition. See the saved state evidence.
Test detailsNo checks recorded · 2m 49s
TokensUnavailable in · Unavailable outUnavailable cached · 0/1 runs covered
LLM spendUnavailable0/1 runs provider-priced
ExecutionLocal · not metered2m 33s agent

Worker phase timing: not captured.

Feedback was not captured for this attempt.

chat-features.runner-opencode.local.companies.archive-company
Attempt
1
Duration
2m 49s
Agent runtime
2m 33s
Runtime
native
Provider
opencode
Model
openrouter/deepseek/deepseek-v4.1-flash-1017

No result artifact was uploaded

Startup reuse evidence
RunWarmthEnvironment/leaseWorkspaceRunnerProvider processProvider sessionProvider launches
f284d0f4-6bca-4a11-be52-300b0ea3025eunknown unknown (evidence_missing)unknown (evidence_missing)unknown (evidence_missing)unknown (evidence_missing)unknown (evidence_missing) unknown

No matcher result was recorded.

Usage, billing and timing metadata
{
  "billing": {
    "llm": {
      "runCount": 1,
      "runsWithTokenUsage": 0,
      "runsWithReportedCost": 0,
      "runsWithEstimatedCost": 0,
      "runsWithPartialReportedCost": 0,
      "inputTokens": 79801,
      "outputTokens": 3496,
      "cachedInputTokens": 610432,
      "totalTokens": 693729,
      "reportedCostUsd": 0,
      "estimatedCostUsd": 0,
      "costStatus": "unavailable"
    },
    "runtime": {
      "provider": "local",
      "agentRunDurationMs": 153178,
      "leaseDurationMs": null,
      "leaseCount": 0,
      "costStatus": "not_metered",
      "costSource": "local_not_metered"
    },
    "reportedCostUsd": 0,
    "estimatedRuntimeCostUsd": 0,
    "observedAndEstimatedCostUsd": 0,
    "complete": false
  },
  "rawUsage": null,
  "workerTiming": null
}
Native OpenCode OpenRouter DeepSeek V4.1 Flash 1017Isolated localopencode · openrouter/deepseek/deepseek-v4.1-flash-1017
Overall failed · No behavioral checks recorded

candidate failure

Timed out waiting for initial identity response; the observed state did not satisfy the condition. See the saved state evidence.
Test detailsNo checks recorded · 2m 49s
TokensUnavailable in · Unavailable outUnavailable cached · 0/1 runs covered
LLM spendUnavailable0/1 runs provider-priced
ExecutionLocal · not metered2m 33s agent

Worker phase timing: not captured.

Feedback was not captured for this attempt.

chat-features.runner-opencode.local.companies.export-company
Attempt
1
Duration
2m 49s
Agent runtime
2m 33s
Runtime
native
Provider
opencode
Model
openrouter/deepseek/deepseek-v4.1-flash-1017

No result artifact was uploaded

Startup reuse evidence
RunWarmthEnvironment/leaseWorkspaceRunnerProvider processProvider sessionProvider launches
76dd2cc0-117f-4387-ab27-5867517de866unknown unknown (evidence_missing)unknown (evidence_missing)unknown (evidence_missing)unknown (evidence_missing)unknown (evidence_missing) unknown

No matcher result was recorded.

Usage, billing and timing metadata
{
  "billing": {
    "llm": {
      "runCount": 1,
      "runsWithTokenUsage": 0,
      "runsWithReportedCost": 0,
      "runsWithEstimatedCost": 0,
      "runsWithPartialReportedCost": 0,
      "inputTokens": 292044,
      "outputTokens": 6255,
      "cachedInputTokens": 1323008,
      "totalTokens": 1621307,
      "reportedCostUsd": 0,
      "estimatedCostUsd": 0,
      "costStatus": "unavailable"
    },
    "runtime": {
      "provider": "local",
      "agentRunDurationMs": 153375,
      "leaseDurationMs": null,
      "leaseCount": 0,
      "costStatus": "not_metered",
      "costSource": "local_not_metered"
    },
    "reportedCostUsd": 0,
    "estimatedRuntimeCostUsd": 0,
    "observedAndEstimatedCostUsd": 0,
    "complete": false
  },
  "rawUsage": null,
  "workerTiming": null
}
Native OpenCode OpenRouter DeepSeek V4.1 Flash 1017Isolated localopencode · openrouter/deepseek/deepseek-v4.1-flash-1017
Overall failed · No behavioral checks recorded

candidate failure

The consequential import conflict was not previewed without mutation and referred to the human
Test detailsNo checks recorded · 1m 39s
Tokens75,002 in · 3,324 out431,104 cached · 1/1 runs covered
LLM spendUnavailable0/1 runs provider-priced
ExecutionLocal · not metered1m 16s agent

Worker phase timing: not captured.

Feedback was not captured for this attempt.

chat-features.runner-opencode.local.companies.import-preview
Attempt
1
Duration
1m 39s
Agent runtime
1m 16s
Runtime
native
Provider
opencode
Model
openrouter/deepseek/deepseek-v4.1-flash-1017

No result artifact was uploaded

Startup reuse evidence
RunWarmthEnvironment/leaseWorkspaceRunnerProvider processProvider sessionProvider launches
3459c0a6-c823-4dd6-90cb-e5399590140cunknown unknown (evidence_missing)unknown (evidence_missing)unknown (evidence_missing)unknown (evidence_missing)unknown (evidence_missing) unknown

No matcher result was recorded.

Usage, billing and timing metadata
{
  "billing": {
    "llm": {
      "runCount": 1,
      "runsWithTokenUsage": 1,
      "runsWithReportedCost": 0,
      "runsWithEstimatedCost": 0,
      "runsWithPartialReportedCost": 0,
      "inputTokens": 75002,
      "outputTokens": 3324,
      "cachedInputTokens": 431104,
      "totalTokens": 509430,
      "reportedCostUsd": 0,
      "estimatedCostUsd": 0,
      "costStatus": "unpriced"
    },
    "runtime": {
      "provider": "local",
      "agentRunDurationMs": 75574,
      "leaseDurationMs": null,
      "leaseCount": 0,
      "costStatus": "not_metered",
      "costSource": "local_not_metered"
    },
    "reportedCostUsd": 0,
    "estimatedRuntimeCostUsd": 0,
    "observedAndEstimatedCostUsd": 0,
    "complete": false
  },
  "rawUsage": null,
  "workerTiming": null
}
Native OpenCode OpenRouter DeepSeek V4.1 Flash 1017Isolated localopencode · openrouter/deepseek/deepseek-v4.1-flash-1017
Test details10/10 checks · 3m 3s
Overall passed · 10/10 behavioral checks passed

No behavioral matcher failed.

See all behavioral checks (10)
ResultCheckDetail
Passchat.complete-model-service-evidenceActual selected account, public saved service configuration and real test receipts are required.
Passchat.real-eligible-shared-accountThe actual validated shared OpenRouter account belongs to this company; a selected chat subscription is not substituted.
Passchat.human-configured-serviceThe canonical chat leaves the disabled board-managed service unchanged; the actual human settings controls save the intended grant and the result survives reload.
Passchat.honest-human-settings-guidanceThe chat names the human settings surface and does not claim a board-only change or test it could not perform.
Passchat.actual-fixed-classifier-samplesBoth actual fixed samples receive the expected model verdict with two independently recorded service charges; built-in fallback or saved configuration cannot masquerade as a working model classifier.
Passchat.bounded-protection-guidanceThe response describes the optional actual control without claiming universal protection.
Passchat.catalog-complete-conditionsNo known catalog condition is omitted.
Passchat.catalog-original-human-queryThe persisted request preserves the catalog query with only audited public-fixture identity bindings; all human turns were declared.
Passchat.catalog-query-attachment-receiptsOnly declared production attachment suffixes are allowed, backed by same-source human receipts and independently retrieved matching bytes.
Passchat.catalog-bounded-native-runsObserved provider runs satisfy declared count, company, native runtime and allowed outcome bounds.
Tokens154,723 in · 9,131 out1,376,768 cached · 1/1 runs covered
LLM spendUnavailable0/1 runs provider-priced
ExecutionLocal · not metered2m 26s agent

Worker phase timing: not captured.

Feedback was not captured for this attempt.

chat-features.runner-opencode.local.companies.prompt-injection-guard
Attempt
1
Duration
3m 3s
Agent runtime
2m 26s
Runtime
native
Provider
opencode
Model
openrouter/deepseek/deepseek-v4.1-flash-1017

All invariants passed

Startup reuse evidence
RunWarmthEnvironment/leaseWorkspaceRunnerProvider processProvider sessionProvider launches
cf058ea5-5ec4-4cc2-adc0-40b3b12d2b35unknown unknown (evidence_missing)unknown (evidence_missing)unknown (evidence_missing)unknown (evidence_missing)unknown (evidence_missing) unknown
ResultMatcherExpectationDetail
Pass json_path {"kind":"json_path","path":"chat.complete-model-service-evidence","expected":true} Actual selected account, public saved service configuration and real test receipts are required.
Pass json_path {"kind":"json_path","path":"chat.real-eligible-shared-account","expected":true} The actual validated shared OpenRouter account belongs to this company; a selected chat subscription is not substituted.
Pass json_path {"kind":"json_path","path":"chat.human-configured-service","expected":true} The canonical chat leaves the disabled board-managed service unchanged; the actual human settings controls save the intended grant and the result survives reload.
Pass json_path {"kind":"json_path","path":"chat.honest-human-settings-guidance","expected":true} The chat names the human settings surface and does not claim a board-only change or test it could not perform.
Pass json_path {"kind":"json_path","path":"chat.actual-fixed-classifier-samples","expected":true} Both actual fixed samples receive the expected model verdict with two independently recorded service charges; built-in fallback or saved configuration cannot masquerade as a working model classifier.
Pass json_path {"kind":"json_path","path":"chat.bounded-protection-guidance","expected":true} The response describes the optional actual control without claiming universal protection.
Pass json_path {"kind":"json_path","path":"chat.catalog-complete-conditions","expected":true} No known catalog condition is omitted.
Pass json_path {"kind":"json_path","path":"chat.catalog-original-human-query","expected":true} The persisted request preserves the catalog query with only audited public-fixture identity bindings; all human turns were declared.
Pass json_path {"kind":"json_path","path":"chat.catalog-query-attachment-receipts","expected":true} Only declared production attachment suffixes are allowed, backed by same-source human receipts and independently retrieved matching bytes.
Pass json_path {"kind":"json_path","path":"chat.catalog-bounded-native-runs","expected":true} Observed provider runs satisfy declared count, company, native runtime and allowed outcome bounds.
Usage, billing and timing metadata
{
  "billing": {
    "llm": {
      "runCount": 1,
      "runsWithTokenUsage": 1,
      "runsWithReportedCost": 0,
      "runsWithEstimatedCost": 0,
      "runsWithPartialReportedCost": 0,
      "inputTokens": 154723,
      "outputTokens": 9131,
      "cachedInputTokens": 1376768,
      "totalTokens": 1540622,
      "reportedCostUsd": 0,
      "estimatedCostUsd": 0,
      "costStatus": "unpriced"
    },
    "runtime": {
      "provider": "local",
      "agentRunDurationMs": 146354,
      "leaseDurationMs": null,
      "leaseCount": 0,
      "costStatus": "not_metered",
      "costSource": "local_not_metered"
    },
    "reportedCostUsd": 0,
    "estimatedRuntimeCostUsd": 0,
    "observedAndEstimatedCostUsd": 0,
    "complete": false
  },
  "rawUsage": null,
  "workerTiming": null
}
Native OpenCode OpenRouter DeepSeek V4.1 Flash 1017Isolated localopencode · openrouter/deepseek/deepseek-v4.1-flash-1017
Test details7/7 checks · 1m 42s
Overall passed · 7/7 behavioral checks passed

No behavioral matcher failed.

See all behavioral checks (7)
ResultCheckDetail
Passchat.independent-registered-deliveryRegistered work products, immutable attachment origin and independently downloaded bytes are required.
Passchat.actual-prior-work-and-source-retainedThe request refers to actual earlier worker-produced website bytes and preserves its source task and execution attribution.
Passchat.new-exact-download-through-product-pathExactly one current-run registered artifact has the independently verified requested bytes and a usable returned product download link.
Passchat.catalog-complete-conditionsNo known catalog condition is omitted.
Passchat.catalog-original-human-queryThe persisted request preserves the catalog query with only audited public-fixture identity bindings; all human turns were declared.
Passchat.catalog-query-attachment-receiptsOnly declared production attachment suffixes are allowed, backed by same-source human receipts and independently retrieved matching bytes.
Passchat.catalog-bounded-native-runsObserved provider runs satisfy declared count, company, native runtime and allowed outcome bounds.
Tokens82,046 in · 2,963 out256,512 cached · 2/2 runs covered
LLM spendUnavailable0/2 runs provider-priced
ExecutionLocal · not metered57s agent

Worker phase timing: not captured.

Feedback was not captured for this attempt.

chat-features.runner-opencode.local.documents-artifacts.produce-download
Attempt
1
Duration
1m 42s
Agent runtime
57s
Runtime
native
Provider
opencode
Model
openrouter/deepseek/deepseek-v4.1-flash-1017

All invariants passed

Startup reuse evidence
RunWarmthEnvironment/leaseWorkspaceRunnerProvider processProvider sessionProvider launches
2fb1a697-5ebb-43d0-a4d3-4b3dddc9d13bunknown unknown (evidence_missing)unknown (evidence_missing)unknown (evidence_missing)unknown (evidence_missing)unknown (evidence_missing) unknown
a1757969-d088-4770-9a5c-dc47883eb5eaunknown unknown (evidence_missing)unknown (evidence_missing)unknown (evidence_missing)unknown (evidence_missing)unknown (evidence_missing) unknown
ResultMatcherExpectationDetail
Pass json_path {"kind":"json_path","path":"chat.independent-registered-delivery","expected":true} Registered work products, immutable attachment origin and independently downloaded bytes are required.
Pass json_path {"kind":"json_path","path":"chat.actual-prior-work-and-source-retained","expected":true} The request refers to actual earlier worker-produced website bytes and preserves its source task and execution attribution.
Pass json_path {"kind":"json_path","path":"chat.new-exact-download-through-product-path","expected":true} Exactly one current-run registered artifact has the independently verified requested bytes and a usable returned product download link.
Pass json_path {"kind":"json_path","path":"chat.catalog-complete-conditions","expected":true} No known catalog condition is omitted.
Pass json_path {"kind":"json_path","path":"chat.catalog-original-human-query","expected":true} The persisted request preserves the catalog query with only audited public-fixture identity bindings; all human turns were declared.
Pass json_path {"kind":"json_path","path":"chat.catalog-query-attachment-receipts","expected":true} Only declared production attachment suffixes are allowed, backed by same-source human receipts and independently retrieved matching bytes.
Pass json_path {"kind":"json_path","path":"chat.catalog-bounded-native-runs","expected":true} Observed provider runs satisfy declared count, company, native runtime and allowed outcome bounds.
Usage, billing and timing metadata
{
  "billing": {
    "llm": {
      "runCount": 2,
      "runsWithTokenUsage": 2,
      "runsWithReportedCost": 0,
      "runsWithEstimatedCost": 0,
      "runsWithPartialReportedCost": 0,
      "inputTokens": 82046,
      "outputTokens": 2963,
      "cachedInputTokens": 256512,
      "totalTokens": 341521,
      "reportedCostUsd": 0,
      "estimatedCostUsd": 0,
      "costStatus": "unpriced"
    },
    "runtime": {
      "provider": "local",
      "agentRunDurationMs": 56586,
      "leaseDurationMs": null,
      "leaseCount": 0,
      "costStatus": "not_metered",
      "costSource": "local_not_metered"
    },
    "reportedCostUsd": 0,
    "estimatedRuntimeCostUsd": 0,
    "observedAndEstimatedCostUsd": 0,
    "complete": false
  },
  "rawUsage": null,
  "workerTiming": null
}
Native OpenCode OpenRouter DeepSeek V4.1 Flash 1017Isolated localopencode · openrouter/deepseek/deepseek-v4.1-flash-1017
Overall failed · No behavioral checks recorded

candidate failure

Stopped waiting for documents-artifacts.revise-delivery: Settled scenario failed: actual-prior-work-and-source-retained, new-exact-download-through-product-path, original-version-still-retrievable
Test detailsNo checks recorded · 2m 15s
Tokens57,227 in · 3,590 out373,632 cached · 2/2 runs covered
LLM spendUnavailable0/2 runs provider-priced
ExecutionLocal · not metered1m 25s agent

Worker phase timing: not captured.

Feedback was not captured for this attempt.

chat-features.runner-opencode.local.documents-artifacts.revise-delivery
Attempt
1
Duration
2m 15s
Agent runtime
1m 25s
Runtime
native
Provider
opencode
Model
openrouter/deepseek/deepseek-v4.1-flash-1017

No result artifact was uploaded

Startup reuse evidence
RunWarmthEnvironment/leaseWorkspaceRunnerProvider processProvider sessionProvider launches
a82943f7-b59a-40c4-94f6-2af08e43c51eunknown unknown (evidence_missing)unknown (evidence_missing)unknown (evidence_missing)unknown (evidence_missing)unknown (evidence_missing) unknown
7bf3337c-04fc-42fd-8059-671fb01ac71eunknown unknown (evidence_missing)unknown (evidence_missing)unknown (evidence_missing)unknown (evidence_missing)unknown (evidence_missing) unknown

No matcher result was recorded.

Usage, billing and timing metadata
{
  "billing": {
    "llm": {
      "runCount": 2,
      "runsWithTokenUsage": 2,
      "runsWithReportedCost": 0,
      "runsWithEstimatedCost": 0,
      "runsWithPartialReportedCost": 0,
      "inputTokens": 57227,
      "outputTokens": 3590,
      "cachedInputTokens": 373632,
      "totalTokens": 434449,
      "reportedCostUsd": 0,
      "estimatedCostUsd": 0,
      "costStatus": "unpriced"
    },
    "runtime": {
      "provider": "local",
      "agentRunDurationMs": 84746,
      "leaseDurationMs": null,
      "leaseCount": 0,
      "costStatus": "not_metered",
      "costSource": "local_not_metered"
    },
    "reportedCostUsd": 0,
    "estimatedRuntimeCostUsd": 0,
    "observedAndEstimatedCostUsd": 0,
    "complete": false
  },
  "rawUsage": null,
  "workerTiming": null
}
Native OpenCode OpenRouter DeepSeek V4.1 Flash 1017Isolated localopencode · openrouter/deepseek/deepseek-v4.1-flash-1017
Overall failed · No behavioral checks recorded

candidate failure

POST /api/companies/d913e0b3-3381-489c-9bd7-111772ca0e62/environments returned 422; body withheld
Test detailsNo checks recorded · 18s
TokensUnavailable in · Unavailable outUnavailable cached · 0/1 runs covered
LLM spendUnavailable0/1 runs provider-priced
ExecutionLocal · not meteredUnknown agent

Worker phase timing: not captured.

Feedback was not captured for this attempt.

chat-features.runner-opencode.local.execution-environments.choose-capable-target
Attempt
1
Duration
18s
Agent runtime
Unknown
Runtime
native
Provider
opencode
Model
openrouter/deepseek/deepseek-v4.1-flash-1017

No result artifact was uploaded

No matcher result was recorded.

Usage, billing and timing metadata
{
  "billing": {
    "llm": {
      "runCount": 1,
      "runsWithTokenUsage": 0,
      "runsWithReportedCost": 0,
      "runsWithEstimatedCost": 0,
      "runsWithPartialReportedCost": 0,
      "inputTokens": 0,
      "outputTokens": 0,
      "cachedInputTokens": 0,
      "totalTokens": 0,
      "reportedCostUsd": 0,
      "estimatedCostUsd": 0,
      "costStatus": "unavailable"
    },
    "runtime": {
      "provider": "local",
      "agentRunDurationMs": null,
      "leaseDurationMs": null,
      "leaseCount": 0,
      "costStatus": "not_metered",
      "costSource": "local_not_metered"
    },
    "reportedCostUsd": 0,
    "estimatedRuntimeCostUsd": 0,
    "observedAndEstimatedCostUsd": 0,
    "complete": false
  },
  "rawUsage": null,
  "workerTiming": null
}
Native OpenCode OpenRouter DeepSeek V4.1 Flash 1017Isolated localopencode · openrouter/deepseek/deepseek-v4.1-flash-1017
Overall failed · No behavioral checks recorded

candidate failure

Initial purpose explanation does not match its saved chain and rationale
Test detailsNo checks recorded · 1m 37s
Tokens35,780 in · 1,731 out192,384 cached · 1/1 runs covered
LLM spendUnavailable0/1 runs provider-priced
ExecutionLocal · not metered1m 14s agent

Worker phase timing: not captured.

Feedback was not captured for this attempt.

chat-features.runner-opencode.local.goals.explain-purpose
Attempt
1
Duration
1m 37s
Agent runtime
1m 14s
Runtime
native
Provider
opencode
Model
openrouter/deepseek/deepseek-v4.1-flash-1017

No result artifact was uploaded

Startup reuse evidence
RunWarmthEnvironment/leaseWorkspaceRunnerProvider processProvider sessionProvider launches
ea893654-15c6-4f3f-8782-b0e9e4a4137bunknown unknown (evidence_missing)unknown (evidence_missing)unknown (evidence_missing)unknown (evidence_missing)unknown (evidence_missing) unknown

No matcher result was recorded.

Usage, billing and timing metadata
{
  "billing": {
    "llm": {
      "runCount": 1,
      "runsWithTokenUsage": 1,
      "runsWithReportedCost": 0,
      "runsWithEstimatedCost": 0,
      "runsWithPartialReportedCost": 0,
      "inputTokens": 35780,
      "outputTokens": 1731,
      "cachedInputTokens": 192384,
      "totalTokens": 229895,
      "reportedCostUsd": 0,
      "estimatedCostUsd": 0,
      "costStatus": "unpriced"
    },
    "runtime": {
      "provider": "local",
      "agentRunDurationMs": 74462,
      "leaseDurationMs": null,
      "leaseCount": 0,
      "costStatus": "not_metered",
      "costSource": "local_not_metered"
    },
    "reportedCostUsd": 0,
    "estimatedRuntimeCostUsd": 0,
    "observedAndEstimatedCostUsd": 0,
    "complete": false
  },
  "rawUsage": null,
  "workerTiming": null
}
Native OpenCode OpenRouter DeepSeek V4.1 Flash 1017Isolated localopencode · openrouter/deepseek/deepseek-v4.1-flash-1017
Test details9/9 checks · 1m 51s
Overall passed · 9/9 behavioral checks passed

No behavioral matcher failed.

See all behavioral checks (9)
ResultCheckDetail
Passchat.independent-design-historySaved design revision, human approval and actual acting-agent search evidence are required.
Passchat.real-approved-revision-retainedThe exact historical revision and real human approval comment remain saved rather than inferring approval from latest edit time.
Passchat.approved-design-distinguished-from-newer-draftThe answer links the actual approved design and explains that the later revision is still a draft.
Passchat.read-only-design-searchFinding a design does not approve a draft, rewrite its history or mutate prerequisite work.
Passchat.inaccessible-design-excludedA healthy acting-agent search cannot expose the inaccessible project's design or snippet, including through copied links.
Passchat.catalog-complete-conditionsNo known catalog condition is omitted.
Passchat.catalog-original-human-queryThe persisted request preserves the catalog query with only audited public-fixture identity bindings; all human turns were declared.
Passchat.catalog-query-attachment-receiptsOnly declared production attachment suffixes are allowed, backed by same-source human receipts and independently retrieved matching bytes.
Passchat.catalog-bounded-native-runsObserved provider runs satisfy declared count, company, native runtime and allowed outcome bounds.
Tokens48,493 in · 3,116 out334,336 cached · 1/1 runs covered
LLM spendUnavailable0/1 runs provider-priced
ExecutionLocal · not metered1m 12s agent

Worker phase timing: not captured.

Feedback was not captured for this attempt.

chat-features.runner-opencode.local.inbox-search.find-design
Attempt
1
Duration
1m 51s
Agent runtime
1m 12s
Runtime
native
Provider
opencode
Model
openrouter/deepseek/deepseek-v4.1-flash-1017

All invariants passed

Startup reuse evidence
RunWarmthEnvironment/leaseWorkspaceRunnerProvider processProvider sessionProvider launches
c1e5e698-33a5-433f-834f-9130314124b9unknown unknown (evidence_missing)unknown (evidence_missing)unknown (evidence_missing)unknown (evidence_missing)unknown (evidence_missing) unknown
ResultMatcherExpectationDetail
Pass json_path {"kind":"json_path","path":"chat.independent-design-history","expected":true} Saved design revision, human approval and actual acting-agent search evidence are required.
Pass json_path {"kind":"json_path","path":"chat.real-approved-revision-retained","expected":true} The exact historical revision and real human approval comment remain saved rather than inferring approval from latest edit time.
Pass json_path {"kind":"json_path","path":"chat.approved-design-distinguished-from-newer-draft","expected":true} The answer links the actual approved design and explains that the later revision is still a draft.
Pass json_path {"kind":"json_path","path":"chat.read-only-design-search","expected":true} Finding a design does not approve a draft, rewrite its history or mutate prerequisite work.
Pass json_path {"kind":"json_path","path":"chat.inaccessible-design-excluded","expected":true} A healthy acting-agent search cannot expose the inaccessible project's design or snippet, including through copied links.
Pass json_path {"kind":"json_path","path":"chat.catalog-complete-conditions","expected":true} No known catalog condition is omitted.
Pass json_path {"kind":"json_path","path":"chat.catalog-original-human-query","expected":true} The persisted request preserves the catalog query with only audited public-fixture identity bindings; all human turns were declared.
Pass json_path {"kind":"json_path","path":"chat.catalog-query-attachment-receipts","expected":true} Only declared production attachment suffixes are allowed, backed by same-source human receipts and independently retrieved matching bytes.
Pass json_path {"kind":"json_path","path":"chat.catalog-bounded-native-runs","expected":true} Observed provider runs satisfy declared count, company, native runtime and allowed outcome bounds.
Usage, billing and timing metadata
{
  "billing": {
    "llm": {
      "runCount": 1,
      "runsWithTokenUsage": 1,
      "runsWithReportedCost": 0,
      "runsWithEstimatedCost": 0,
      "runsWithPartialReportedCost": 0,
      "inputTokens": 48493,
      "outputTokens": 3116,
      "cachedInputTokens": 334336,
      "totalTokens": 385945,
      "reportedCostUsd": 0,
      "estimatedCostUsd": 0,
      "costStatus": "unpriced"
    },
    "runtime": {
      "provider": "local",
      "agentRunDurationMs": 71961,
      "leaseDurationMs": null,
      "leaseCount": 0,
      "costStatus": "not_metered",
      "costSource": "local_not_metered"
    },
    "reportedCostUsd": 0,
    "estimatedRuntimeCostUsd": 0,
    "observedAndEstimatedCostUsd": 0,
    "complete": false
  },
  "rawUsage": null,
  "workerTiming": null
}
Native OpenCode OpenRouter DeepSeek V4.1 Flash 1017Isolated localopencode · openrouter/deepseek/deepseek-v4.1-flash-1017
Overall failed · No behavioral checks recorded

candidate failure

Timed out waiting for Canonical privileged guidance settled; the observed state did not satisfy the condition. See the saved state evidence.
Test detailsNo checks recorded · 2m 55s
TokensUnavailable in · Unavailable outUnavailable cached · 0/1 runs covered
LLM spendUnavailable0/1 runs provider-priced
ExecutionLocal · not metered2m 34s agent

Worker phase timing: not captured.

Feedback was not captured for this attempt.

chat-features.runner-opencode.local.instance-operations.instance-settings
Attempt
1
Duration
2m 55s
Agent runtime
2m 34s
Runtime
native
Provider
opencode
Model
openrouter/deepseek/deepseek-v4.1-flash-1017

No result artifact was uploaded

Startup reuse evidence
RunWarmthEnvironment/leaseWorkspaceRunnerProvider processProvider sessionProvider launches
3703a72b-a8f1-43a6-bf62-13570481ff2funknown unknown (evidence_missing)unknown (evidence_missing)unknown (evidence_missing)unknown (evidence_missing)unknown (evidence_missing) unknown

No matcher result was recorded.

Usage, billing and timing metadata
{
  "billing": {
    "llm": {
      "runCount": 1,
      "runsWithTokenUsage": 0,
      "runsWithReportedCost": 0,
      "runsWithEstimatedCost": 0,
      "runsWithPartialReportedCost": 0,
      "inputTokens": 135723,
      "outputTokens": 4039,
      "cachedInputTokens": 940544,
      "totalTokens": 1080306,
      "reportedCostUsd": 0,
      "estimatedCostUsd": 0,
      "costStatus": "unavailable"
    },
    "runtime": {
      "provider": "local",
      "agentRunDurationMs": 154297,
      "leaseDurationMs": null,
      "leaseCount": 0,
      "costStatus": "not_metered",
      "costSource": "local_not_metered"
    },
    "reportedCostUsd": 0,
    "estimatedRuntimeCostUsd": 0,
    "observedAndEstimatedCostUsd": 0,
    "complete": false
  },
  "rawUsage": null,
  "workerTiming": null
}
Native OpenCode OpenRouter DeepSeek V4.1 Flash 1017Isolated localopencode · openrouter/deepseek/deepseek-v4.1-flash-1017
Overall failed · No behavioral checks recorded

candidate failure

Timed out waiting for Canonical project-defaults turn settles; the observed state did not satisfy the condition. See the saved state evidence.
Test detailsNo checks recorded · 3m 25s
TokensUnavailable in · Unavailable outUnavailable cached · 0/2 runs covered
LLM spendUnavailable0/2 runs provider-priced
ExecutionLocal · not metered5m 37s agent

Worker phase timing: not captured.

Feedback was not captured for this attempt.

chat-features.runner-opencode.local.projects.project-defaults
Attempt
1
Duration
3m 25s
Agent runtime
5m 37s
Runtime
native
Provider
opencode
Model
openrouter/deepseek/deepseek-v4.1-flash-1017

No result artifact was uploaded

Startup reuse evidence
RunWarmthEnvironment/leaseWorkspaceRunnerProvider processProvider sessionProvider launches
a2c94d1d-66bb-45dd-8959-59de4d3c63eaunknown unknown (evidence_missing)unknown (evidence_missing)unknown (evidence_missing)unknown (evidence_missing)unknown (evidence_missing) unknown
8fd40500-f926-4eef-9da9-0d1bfe78c3feunknown unknown (evidence_missing)unknown (evidence_missing)unknown (evidence_missing)unknown (evidence_missing)unknown (evidence_missing) unknown

No matcher result was recorded.

Usage, billing and timing metadata
{
  "billing": {
    "llm": {
      "runCount": 2,
      "runsWithTokenUsage": 0,
      "runsWithReportedCost": 0,
      "runsWithEstimatedCost": 0,
      "runsWithPartialReportedCost": 0,
      "inputTokens": 111121,
      "outputTokens": 6994,
      "cachedInputTokens": 1152000,
      "totalTokens": 1270115,
      "reportedCostUsd": 0,
      "estimatedCostUsd": 0,
      "costStatus": "unavailable"
    },
    "runtime": {
      "provider": "local",
      "agentRunDurationMs": 337224,
      "leaseDurationMs": null,
      "leaseCount": 0,
      "costStatus": "not_metered",
      "costSource": "local_not_metered"
    },
    "reportedCostUsd": 0,
    "estimatedRuntimeCostUsd": 0,
    "observedAndEstimatedCostUsd": 0,
    "complete": false
  },
  "rawUsage": null,
  "workerTiming": null
}
Native OpenCode OpenRouter DeepSeek V4.1 Flash 1017Isolated localopencode · openrouter/deepseek/deepseek-v4.1-flash-1017
Overall failed · No behavioral checks recorded

candidate failure

Timed out waiting for initial identity response; the observed state did not satisfy the condition. See the saved state evidence.
Test detailsNo checks recorded · 2m 54s
TokensUnavailable in · Unavailable outUnavailable cached · 0/2 runs covered
LLM spendUnavailable0/2 runs provider-priced
ExecutionLocal · not meteredUnknown agent

Worker phase timing: not captured.

Feedback was not captured for this attempt.

chat-features.runner-opencode.local.questions-and-approvals.accept-one-proposal
Attempt
1
Duration
2m 54s
Agent runtime
Unknown
Runtime
native
Provider
opencode
Model
openrouter/deepseek/deepseek-v4.1-flash-1017

No result artifact was uploaded

Startup reuse evidence
RunWarmthEnvironment/leaseWorkspaceRunnerProvider processProvider sessionProvider launches
878c16de-3d5f-4526-85e9-840ade53be82unknown unknown (evidence_missing)unknown (evidence_missing)unknown (evidence_missing)unknown (evidence_missing)unknown (evidence_missing) unknown
caf614ba-beda-4525-9f1d-9fabf8df7a40unknown unknown (evidence_missing)unknown (evidence_missing)unknown (evidence_missing)unknown (evidence_missing)unknown (evidence_missing) unknown

No matcher result was recorded.

Usage, billing and timing metadata
{
  "billing": {
    "llm": {
      "runCount": 2,
      "runsWithTokenUsage": 0,
      "runsWithReportedCost": 0,
      "runsWithEstimatedCost": 0,
      "runsWithPartialReportedCost": 0,
      "inputTokens": 217100,
      "outputTokens": 4485,
      "cachedInputTokens": 460597,
      "totalTokens": 682182,
      "reportedCostUsd": 0,
      "estimatedCostUsd": 0,
      "costStatus": "unavailable"
    },
    "runtime": {
      "provider": "local",
      "agentRunDurationMs": null,
      "leaseDurationMs": null,
      "leaseCount": 0,
      "costStatus": "not_metered",
      "costSource": "local_not_metered"
    },
    "reportedCostUsd": 0,
    "estimatedRuntimeCostUsd": 0,
    "observedAndEstimatedCostUsd": 0,
    "complete": false
  },
  "rawUsage": null,
  "workerTiming": null
}