Full-stack acceptance campaign

Runner Full-Stack E2E

Results across runner profiles and execution environments. Declared PNG screenshots and normalized results are retained with every published campaign; additional diagnostic evidence remains in the access-controlled workflow artifact.

2026-10-28T05:20:04.735Z81bba1ddSource run ↗Campaign summary ↗

0/8Passed
8Failed
28m 14sSummed attempt time
Campaign notes and coverage
# Current production chat evaluation: completed eight-case snapshot

This is a partial snapshot of run [40630370749](https://github.com/paperclipai/paperclip/actions/runs/40630370749), source `81bba1dd0d4f77448bf4c5e360f3c78760e34ce2`, production baseline `39e811c9c5226979fce42e052a27cfb28301018a`. Exact configured model: `openrouter/deepseek/deepseek-v4.1-flash-1017` through OpenCode/OpenRouter.

## What actually works on the current production baseline

| Actual human request | Observed end-to-end state proof | Existing evidence page |
| --- | --- | --- |
| Have Morgan report to Riley from now on. | Saved manager change and organization view; relevant assignment and company invariants retained, 9/9 checks. | [Pilot](https://d1p6rlowie26tp.cloudfront.net/runner-e2e/campaigns/gha-40620786554-1-five-report/) |
| Archive the Launch project but keep its history. | Actual archived project with readable retained history, 10/10 checks. | [Pilot](https://d1p6rlowie26tp.cloudfront.net/runner-e2e/campaigns/gha-40620786554-1-five-report/) |
| Save a short implementation plan on the website task. | Versioned plan saved on the intended task, actual document link and substantive brief facts retained, 9/9 checks. | [Twelve-case report](https://d1p6rlowie26tp.cloudfront.net/runner-e2e/campaigns/gha-40624431756-1-full12-report/) |
| Fix the confusing pricing paragraph and resolve my comment. | Actual anchored document edit and correct annotation resolution, unrelated feedback preserved, 9/9 checks. | [Twelve-case report](https://d1p6rlowie26tp.cloudfront.net/runner-e2e/campaigns/gha-40624431756-1-full12-report/) |

These four are measured passes on production39e. [The full 244-scenario coverage inventory and prerequisite lists](https://d1p6rlowie26tp.cloudfront.net/runner-e2e/campaigns/gha-40584967834-1-final34-report/) remain inspectable in the preceding historical report. Its old outcomes are historical, not extra current-baseline passes. Current measured outcomes and counts are below.

## First four final-correction outcomes

The first four selected final corrections all failed. Their original outcomes and prior attempts remain unchanged; these four final allowances are exhausted. All four completed cleanup and have evidence manifests with no leaks or missing files. At this snapshot eight selected cells are measured and the remaining 32 await completed evidence; bounded normal waves have resumed. Queued jobs consume no scenario attempt. This snapshot does not establish a shared provider outage or transport cause.

| Scenario | Actual outcome and stage | Evidence-supported cause or limitation | Remaining correction |
| --- | --- | --- | --- |
| cases.browse-cases | FAIL; actual native succeeded | Correct C1/C2 plaintext results and excluded done C3, but the rendered reply had no usable case links. A separate UI propagation defect is being addressed; this result remains failed. | 0 |
| agents.managed-profile | FAIL; canonical query sent, native still running at phase deadline | Empty reply; no terminal error observed. No provider cause established. | 0 |
| budgets-costs.spend-breakdown | FAIL; main native succeeded | Reply reported repeated basic MCP request timeouts and did not supply the actual agent breakdown/incomplete-total outcome. Retained handler results exist; the delivery boundary/cause is unresolved. Warmup did not show the same markers. | 0 |
| budgets-costs.resolve-budget | FAIL; canonical query sent, native succeeded | A real bound budget question with a $10 choice was visible despite empty prose. The fixture used a separate board incident control without answering that question, so its intended question/response-wake continuation was not verified. Original final remains failed/exhausted. | 0 |

## Four additional completed outcomes

| Scenario | Original outcome / actual native evidence | Evidence-supported limitation | Remaining correction |
| --- | --- | --- | --- |
| companies.archive-company | FAILED initial; one actual started native, still running at phase deadline and cancelled during cleanup | Generic identity-response wait did not obtain the required archive/restore response; no terminal provider cause established. | 1 |
| cases.create-case | FAILED final; three recorded run rows, only two have actual start timestamps | Declared run-bound guard stopped the case. The unstarted queued row is not a third native execution. No partial result is promoted to pass. | 0 |
| companies.agent-observability | FAILED initial; two actual native runs succeeded | Required real native harness trace export was not observed within the wait. The absence of the export is retained without an inferred provider cause. | 1 |
| cases.cases-disabled | FAILED final; one native remained running at the frozen outer deadline, then cleanup cancelled it | Required truthful availability/choice did not settle; one request-timeout marker was observed. That isolated symptom is not proof of a shared transport cause. | 0 |

All eight originals retain FAILED status, cleanup passed, and manifests with no leaks or missing files. Cases run-row limits and actual native executions are distinct evidence. No timeout, queued row or partial semantic success is silently regraded.

## Current baseline coverage

Across the five-case pilot, twelve initial journeys, and these eight current-run measurements: **25 distinct scenarios measured: 4 passed, 21 failed, 219 not measured on this production baseline**, totaling 244. There are 25 actual measurements on this refreshed baseline. Historical measurements and passes from earlier production/model lanes remain separate. The separate one-case instrumented artifact-search diagnostic is not included in these clean-production counts.

Current passing scenarios are `agents.change-manager`, `projects.archive-project`, `documents-artifacts.write-plan`, and `documents-artifacts.resolve-feedback`. A pass represents its actual tested end-to-end outcome, not coverage for other unrun scenarios. The previous official [twelve-case report](https://d1p6rlowie26tp.cloudfront.net/runner-e2e/campaigns/gha-40624431756-1-full12-report/) retains the complete preceding measured outcomes.

Unmeasured includes the 32 cells of this manifest without completed imported evidence plus other unrun journeys, explicit invitation/core dependencies, external prerequisites, and incomplete or blocked public paths. None is counted as a pass or manufactured failure. No original measurement or timeout is regraded by this summary.

## Separate diagnostic evidence

The instrumented artifact-search initial in [40635108320](https://github.com/paperclipai/paperclip/actions/runs/40635108320) remains FAILED, with clean cleanup/privacy. Its retained timing showed 15 successful Paperclip MCP tool completions and no request timeout in that sample. This does not establish universal health or explain earlier failures. Its source/native build differs from clean production39e, so it supplies no clean-production pass credit. A narrow returned-copy observer/oracle correction is under independent review; no regrade or final retry has occurred.
Campaign usage and spend
0 / 0Complaints / suggestions · retained attempts0 distinct items · 8 attempts with incomplete collection · 0 failed submissions · 0 unresolved submissions
8Retained attempts0 missing attempts · 0 out-of-scope artifacts
739,049 (partial: 6/12 runs)Input tokens
32,020 (partial: 6/12 runs)Output tokens
3,382,257 (partial: 6/12 runs)Cached tokens
UnavailableLLM reported subtotal
$0.000000Daytona list estimate
63m 46sObserved attempt window8 retained attempts · 0 missing attempts

Attempt durations include setup and cleanup captured inside each attempt. The observed window spans the earliest retained start to the latest retained finish, including gaps and overlap. Carried-forward evidence can span older runs, so this window is not the current workflow's duration. Neither measure is CI queue/setup time or provider-billed runtime.

UnknownAgent execution time
0msDaytona lease time
0/12Runs provider-priced

Campaign costs include retained attempts, including failed retries. Result cards show the selected attempt. Provider-reported amounts and model estimates are separate; unpriced or unavailable runs are excluded, never counted as free. Coverage describes captured usage; unobserved setup, subscriptions, tools, CI and storage require additional accounting. Daytona runtime is a public-list-price estimate from captured lease time and pinned resources, before credits, discounts, storage allowance, or invoice adjustments. Local execution has no external runtime meter.

UnknownWorker setup time
UnknownWorker execution time
UnknownWorker feedback time
UnknownWorker cleanup time
UnknownWorker finalization time

0/8 complete worker receipts; 0 partial; 0 missing attempts. Worker phases cover the test callback through finalization before result publication. Browser/server startup, parent cleanup, CI queue/build time and provider-billed runtime are outside these measurements. An interrupted phase has no inferred end time.

Campaign feedback review

0 distinct feedback items await review. Collection gaps and failed submissions remain separate findings.

Full bodies and review rationale stay in private evidence. Exact duplicate bodies are grouped once; related causes can be linked by a reviewed duplicate disposition.

All results

Feature coverage 0 of 192 capabilities linked · 0 of 8 tests mapped

Associations use the current feature map. Counts describe linked test scenarios; a passing journey does not establish full coverage of a capability.

Getting started and access

FeatureCapabilities linkedLinked test results
Onboarding and first work 0/5 No mapped journey
Login, invitations, and access 0/5 No mapped journey
Companies and portability 0/8 No mapped journey

Tasks and conversations

FeatureCapabilities linkedLinked test results
Task creation and lifecycle 0/6 No mapped journey
Delegation, dependencies, and signoff 0/4 No mapped journey
Inbox, decisions, and search 0/5 No mapped journey
Agent conversations and project handoff 0/4 No mapped journey
Questions and approvals 0/8 No mapped journey
Steering and queued messages 0/7 No mapped journey
Documents, attachments, and work products 0/5 No mapped journey

Agents and reusable capabilities

FeatureCapabilities linkedLinked test results
Hiring, configuration, and organization 0/9 No mapped journey
Runs, harnesses, and model accounts 0/5 No mapped journey
Skills and Skill Studio 0/5 No mapped journey
Team packages and installation 0/4 No mapped journey

Projects and execution

FeatureCapabilities linkedLinked test results
Projects and repositories 0/5 No mapped journey
Goals and work alignment 0/3 No mapped journey
Workspaces, services, and files 0/5 No mapped journey
Execution environments 0/5 No mapped journey
Recovery 0/8 No mapped journey

Apps, channels, and extensions

FeatureCapabilities linkedLinked test results
Connection setup 0/8 No mapped journey
Assistant connections (MCP) 0/5 No mapped journey
App access and action permissions 0/5 No mapped journey
External chat and email 0/6 No mapped journey
Tool gateways and access profiles 0/5 No mapped journey
Secrets and proposals 0/5 No mapped journey
Plugins 0/4 No mapped journey

Automation and structured work

FeatureCapabilities linkedLinked test results
Routines, schedules, and triggers 0/5 No mapped journey
Cases 0/5 No mapped journey
Status cards 0/4 No mapped journey

Oversight and operation

FeatureCapabilities linkedLinked test results
Costs and budgets 0/6 No mapped journey
Dashboards and audit trails 0/6 No mapped journey
Navigation, profile, and announcements 0/6 No mapped journey
Instance operations 0/6 No mapped journey
CLI/API and local worktrees 0/6 No mapped journey

Contributor surfaces

FeatureCapabilities linkedLinked test results
Developer previews and diagnostic labs 0/4 No mapped journey

Test suite

Chat feature journeys

Executable catalog requests through Agent Chat, with independently graded persisted state.

Pass rate0.0%0/8 passed
Tokens4,153,326 (partial: 6/12 runs)739,049 (partial: 6/12 runs) input · 32,020 (partial: 6/12 runs) output
Known spendUnavailablereported LLM + model/runtime estimates estimate
Agent timeUnknown0ms lease
Execution8/80 retries · cleanup passed
Native OpenCode OpenRouter DeepSeek V4.1 Flash 1017Isolated localopencode · openrouter/deepseek/deepseek-v4.1-flash-1017
Overall failed · No behavioral checks recorded

candidate failure

Timed out waiting for initial identity response; the observed state did not satisfy the condition. See the saved state evidence.
Test detailsNo checks recorded · 2m 51s
TokensUnavailable in · Unavailable outUnavailable cached · 0/1 runs covered
LLM spendUnavailable0/1 runs provider-priced
ExecutionLocal · not metered2m 33s agent

Worker phase timing: not captured.

Feedback was not captured for this attempt.

chat-features.runner-opencode.local.agents.managed-profile
Attempt
1
Duration
2m 51s
Agent runtime
2m 33s
Runtime
native
Provider
opencode
Model
openrouter/deepseek/deepseek-v4.1-flash-1017

No result artifact was uploaded

Startup reuse evidence
RunWarmthEnvironment/leaseWorkspaceRunnerProvider processProvider sessionProvider launches
a86d7161-e197-4b1f-9cf2-231ee07c0c2aunknown unknown (evidence_missing)unknown (evidence_missing)unknown (evidence_missing)unknown (evidence_missing)unknown (evidence_missing) unknown

No matcher result was recorded.

Usage, billing and timing metadata
{
  "billing": {
    "llm": {
      "runCount": 1,
      "runsWithTokenUsage": 0,
      "runsWithReportedCost": 0,
      "runsWithEstimatedCost": 0,
      "runsWithPartialReportedCost": 0,
      "inputTokens": 0,
      "outputTokens": 0,
      "cachedInputTokens": 0,
      "totalTokens": 0,
      "reportedCostUsd": 0,
      "estimatedCostUsd": 0,
      "costStatus": "unavailable"
    },
    "runtime": {
      "provider": "local",
      "agentRunDurationMs": 152635,
      "leaseDurationMs": null,
      "leaseCount": 0,
      "costStatus": "not_metered",
      "costSource": "local_not_metered"
    },
    "reportedCostUsd": 0,
    "estimatedRuntimeCostUsd": 0,
    "observedAndEstimatedCostUsd": 0,
    "complete": false
  },
  "rawUsage": null,
  "workerTiming": null
}
Native OpenCode OpenRouter DeepSeek V4.1 Flash 1017Isolated localopencode · openrouter/deepseek/deepseek-v4.1-flash-1017
Overall failed · No behavioral checks recorded

candidate failure

Stopped waiting for budgets-costs.resolve-budget: Settled scenario failed: honest-incident-guidance
Test detailsNo checks recorded · 2m 45s
Tokens45,865 in · 3,539 out225,792 cached · 1/1 runs covered
LLM spendUnavailable0/1 runs provider-priced
ExecutionLocal · not metered1m 57s agent

Worker phase timing: not captured.

Feedback was not captured for this attempt.

chat-features.runner-opencode.local.budgets-costs.resolve-budget
Attempt
1
Duration
2m 45s
Agent runtime
1m 57s
Runtime
native
Provider
opencode
Model
openrouter/deepseek/deepseek-v4.1-flash-1017

No result artifact was uploaded

Startup reuse evidence
RunWarmthEnvironment/leaseWorkspaceRunnerProvider processProvider sessionProvider launches
064aba24-b851-4042-89c7-0b768ed9ba5dunknown unknown (evidence_missing)unknown (evidence_missing)unknown (evidence_missing)unknown (evidence_missing)unknown (evidence_missing) unknown

No matcher result was recorded.

Usage, billing and timing metadata
{
  "billing": {
    "llm": {
      "runCount": 1,
      "runsWithTokenUsage": 1,
      "runsWithReportedCost": 0,
      "runsWithEstimatedCost": 0,
      "runsWithPartialReportedCost": 0,
      "inputTokens": 45865,
      "outputTokens": 3539,
      "cachedInputTokens": 225792,
      "totalTokens": 275196,
      "reportedCostUsd": 0,
      "estimatedCostUsd": 0,
      "costStatus": "unpriced"
    },
    "runtime": {
      "provider": "local",
      "agentRunDurationMs": 116907,
      "leaseDurationMs": null,
      "leaseCount": 0,
      "costStatus": "not_metered",
      "costSource": "local_not_metered"
    },
    "reportedCostUsd": 0,
    "estimatedRuntimeCostUsd": 0,
    "observedAndEstimatedCostUsd": 0,
    "complete": false
  },
  "rawUsage": null,
  "workerTiming": null
}
Native OpenCode OpenRouter DeepSeek V4.1 Flash 1017Isolated localopencode · openrouter/deepseek/deepseek-v4.1-flash-1017
Overall failed · No behavioral checks recorded

candidate failure

Stopped waiting for budgets-costs.spend-breakdown: Settled scenario failed: actual-agent-breakdown-and-incomplete-total
Test detailsNo checks recorded · 8m 10s
Tokens128,741 in · 10,422 out510,065 cached · 2/2 runs covered
LLM spendUnavailable0/2 runs provider-priced
ExecutionLocal · not metered7m 22s agent

Worker phase timing: not captured.

Feedback was not captured for this attempt.

chat-features.runner-opencode.local.budgets-costs.spend-breakdown
Attempt
1
Duration
8m 10s
Agent runtime
7m 22s
Runtime
native
Provider
opencode
Model
openrouter/deepseek/deepseek-v4.1-flash-1017

No result artifact was uploaded

Startup reuse evidence
RunWarmthEnvironment/leaseWorkspaceRunnerProvider processProvider sessionProvider launches
77f094e2-09d7-44ae-a5e0-d0e302e2126aunknown unknown (evidence_missing)unknown (evidence_missing)unknown (evidence_missing)unknown (evidence_missing)unknown (evidence_missing) unknown
73289377-fa8e-40c3-84e9-d104583765f9unknown unknown (evidence_missing)unknown (evidence_missing)unknown (evidence_missing)unknown (evidence_missing)unknown (evidence_missing) unknown

No matcher result was recorded.

Usage, billing and timing metadata
{
  "billing": {
    "llm": {
      "runCount": 2,
      "runsWithTokenUsage": 2,
      "runsWithReportedCost": 0,
      "runsWithEstimatedCost": 0,
      "runsWithPartialReportedCost": 0,
      "inputTokens": 128741,
      "outputTokens": 10422,
      "cachedInputTokens": 510065,
      "totalTokens": 649228,
      "reportedCostUsd": 0,
      "estimatedCostUsd": 0,
      "costStatus": "unpriced"
    },
    "runtime": {
      "provider": "local",
      "agentRunDurationMs": 441924,
      "leaseDurationMs": null,
      "leaseCount": 0,
      "costStatus": "not_metered",
      "costSource": "local_not_metered"
    },
    "reportedCostUsd": 0,
    "estimatedRuntimeCostUsd": 0,
    "observedAndEstimatedCostUsd": 0,
    "complete": false
  },
  "rawUsage": null,
  "workerTiming": null
}
Native OpenCode OpenRouter DeepSeek V4.1 Flash 1017Isolated localopencode · openrouter/deepseek/deepseek-v4.1-flash-1017
Overall failed · No behavioral checks recorded

candidate failure

Stopped waiting for cases.browse-cases: Settled scenario failed: exact-filtered-case-results
Test detailsNo checks recorded · 1m 39s
Tokens56,807 in · 1,035 out228,992 cached · 1/1 runs covered
LLM spendUnavailable0/1 runs provider-priced
ExecutionLocal · not metered1m 4s agent

Worker phase timing: not captured.

Feedback was not captured for this attempt.

chat-features.runner-opencode.local.cases.browse-cases
Attempt
1
Duration
1m 39s
Agent runtime
1m 4s
Runtime
native
Provider
opencode
Model
openrouter/deepseek/deepseek-v4.1-flash-1017

No result artifact was uploaded

Startup reuse evidence
RunWarmthEnvironment/leaseWorkspaceRunnerProvider processProvider sessionProvider launches
83c76410-68d8-46c5-aa88-c64410530248unknown unknown (evidence_missing)unknown (evidence_missing)unknown (evidence_missing)unknown (evidence_missing)unknown (evidence_missing) unknown

No matcher result was recorded.

Usage, billing and timing metadata
{
  "billing": {
    "llm": {
      "runCount": 1,
      "runsWithTokenUsage": 1,
      "runsWithReportedCost": 0,
      "runsWithEstimatedCost": 0,
      "runsWithPartialReportedCost": 0,
      "inputTokens": 56807,
      "outputTokens": 1035,
      "cachedInputTokens": 228992,
      "totalTokens": 286834,
      "reportedCostUsd": 0,
      "estimatedCostUsd": 0,
      "costStatus": "unpriced"
    },
    "runtime": {
      "provider": "local",
      "agentRunDurationMs": 63589,
      "leaseDurationMs": null,
      "leaseCount": 0,
      "costStatus": "not_metered",
      "costSource": "local_not_metered"
    },
    "reportedCostUsd": 0,
    "estimatedRuntimeCostUsd": 0,
    "observedAndEstimatedCostUsd": 0,
    "complete": false
  },
  "rawUsage": null,
  "workerTiming": null
}
Native OpenCode OpenRouter DeepSeek V4.1 Flash 1017Isolated localopencode · openrouter/deepseek/deepseek-v4.1-flash-1017
Overall failed · No behavioral checks recorded

candidate failure

Timed out waiting for cases.cases-disabled; truthful-availability-and-choice, catalog-bounded-native-runs. See the saved state evidence.
Test detailsNo checks recorded · 4m 51s
TokensUnavailable in · Unavailable outUnavailable cached · 0/1 runs covered
LLM spendUnavailable0/1 runs provider-priced
ExecutionLocal · not metered4m 32s agent

Worker phase timing: not captured.

Feedback was not captured for this attempt.

chat-features.runner-opencode.local.cases.cases-disabled
Attempt
1
Duration
4m 51s
Agent runtime
4m 32s
Runtime
native
Provider
opencode
Model
openrouter/deepseek/deepseek-v4.1-flash-1017

No result artifact was uploaded

Startup reuse evidence
RunWarmthEnvironment/leaseWorkspaceRunnerProvider processProvider sessionProvider launches
144d8422-2c00-4c7d-a809-531989185bbbunknown unknown (evidence_missing)unknown (evidence_missing)unknown (evidence_missing)unknown (evidence_missing)unknown (evidence_missing) unknown

No matcher result was recorded.

Usage, billing and timing metadata
{
  "billing": {
    "llm": {
      "runCount": 1,
      "runsWithTokenUsage": 0,
      "runsWithReportedCost": 0,
      "runsWithEstimatedCost": 0,
      "runsWithPartialReportedCost": 0,
      "inputTokens": 137013,
      "outputTokens": 4748,
      "cachedInputTokens": 860160,
      "totalTokens": 1001921,
      "reportedCostUsd": 0,
      "estimatedCostUsd": 0,
      "costStatus": "unavailable"
    },
    "runtime": {
      "provider": "local",
      "agentRunDurationMs": 272355,
      "leaseDurationMs": null,
      "leaseCount": 0,
      "costStatus": "not_metered",
      "costSource": "local_not_metered"
    },
    "reportedCostUsd": 0,
    "estimatedRuntimeCostUsd": 0,
    "observedAndEstimatedCostUsd": 0,
    "complete": false
  },
  "rawUsage": null,
  "workerTiming": null
}
Native OpenCode OpenRouter DeepSeek V4.1 Flash 1017Isolated localopencode · openrouter/deepseek/deepseek-v4.1-flash-1017
Overall failed · No behavioral checks recorded

candidate failure

Stopped waiting for cases.create-case: Scenario exceeded its declared run bound
Test detailsNo checks recorded · 1m 55s
TokensUnavailable in · Unavailable outUnavailable cached · 0/3 runs covered
LLM spendUnavailable0/3 runs provider-priced
ExecutionLocal · not meteredUnknown agent

Worker phase timing: not captured.

Feedback was not captured for this attempt.

chat-features.runner-opencode.local.cases.create-case
Attempt
1
Duration
1m 55s
Agent runtime
Unknown
Runtime
native
Provider
opencode
Model
openrouter/deepseek/deepseek-v4.1-flash-1017

No result artifact was uploaded

Startup reuse evidence
RunWarmthEnvironment/leaseWorkspaceRunnerProvider processProvider sessionProvider launches
7bb43feb-e662-4c14-9aba-dbe91b6514e7unknown unknown (evidence_missing)unknown (evidence_missing)unknown (evidence_missing)unknown (evidence_missing)unknown (evidence_missing) unknown
978a19ad-d34f-4ec0-8243-b9a83e82561dunknown unknown (evidence_missing)unknown (evidence_missing)unknown (evidence_missing)unknown (evidence_missing)unknown (evidence_missing) unknown
b5d759b8-5396-4850-9c67-5a4a40ae6ce2unknown unknown (evidence_missing)unknown (evidence_missing)unknown (evidence_missing)unknown (evidence_missing)unknown (evidence_missing) unknown

No matcher result was recorded.

Usage, billing and timing metadata
{
  "billing": {
    "llm": {
      "runCount": 3,
      "runsWithTokenUsage": 0,
      "runsWithReportedCost": 0,
      "runsWithEstimatedCost": 0,
      "runsWithPartialReportedCost": 0,
      "inputTokens": 41987,
      "outputTokens": 3690,
      "cachedInputTokens": 501888,
      "totalTokens": 547565,
      "reportedCostUsd": 0,
      "estimatedCostUsd": 0,
      "costStatus": "unavailable"
    },
    "runtime": {
      "provider": "local",
      "agentRunDurationMs": null,
      "leaseDurationMs": null,
      "leaseCount": 0,
      "costStatus": "not_metered",
      "costSource": "local_not_metered"
    },
    "reportedCostUsd": 0,
    "estimatedRuntimeCostUsd": 0,
    "observedAndEstimatedCostUsd": 0,
    "complete": false
  },
  "rawUsage": null,
  "workerTiming": null
}
Native OpenCode OpenRouter DeepSeek V4.1 Flash 1017Isolated localopencode · openrouter/deepseek/deepseek-v4.1-flash-1017
Overall failed · No behavioral checks recorded

candidate failure

Timed out waiting for actual native harness trace export; the observed state did not satisfy the condition. See the saved state evidence.
Test detailsNo checks recorded · 3m 14s
Tokens248,835 in · 5,090 out444,928 cached · 2/2 runs covered
LLM spendUnavailable0/2 runs provider-priced
ExecutionLocal · not metered2m 9s agent

Worker phase timing: not captured.

Feedback was not captured for this attempt.

chat-features.runner-opencode.local.companies.agent-observability
Attempt
1
Duration
3m 14s
Agent runtime
2m 9s
Runtime
native
Provider
opencode
Model
openrouter/deepseek/deepseek-v4.1-flash-1017

No result artifact was uploaded

Startup reuse evidence
RunWarmthEnvironment/leaseWorkspaceRunnerProvider processProvider sessionProvider launches
28ede845-4260-4131-b9e6-e00ce79a4cb3unknown unknown (evidence_missing)unknown (evidence_missing)unknown (evidence_missing)unknown (evidence_missing)unknown (evidence_missing) unknown
de0e05b8-c9fe-40df-b87d-3d54d96654d0unknown unknown (evidence_missing)unknown (evidence_missing)unknown (evidence_missing)unknown (evidence_missing)unknown (evidence_missing) unknown

No matcher result was recorded.

Usage, billing and timing metadata
{
  "billing": {
    "llm": {
      "runCount": 2,
      "runsWithTokenUsage": 2,
      "runsWithReportedCost": 0,
      "runsWithEstimatedCost": 0,
      "runsWithPartialReportedCost": 0,
      "inputTokens": 248835,
      "outputTokens": 5090,
      "cachedInputTokens": 444928,
      "totalTokens": 698853,
      "reportedCostUsd": 0,
      "estimatedCostUsd": 0,
      "costStatus": "unpriced"
    },
    "runtime": {
      "provider": "local",
      "agentRunDurationMs": 129321,
      "leaseDurationMs": null,
      "leaseCount": 0,
      "costStatus": "not_metered",
      "costSource": "local_not_metered"
    },
    "reportedCostUsd": 0,
    "estimatedRuntimeCostUsd": 0,
    "observedAndEstimatedCostUsd": 0,
    "complete": false
  },
  "rawUsage": null,
  "workerTiming": null
}
Native OpenCode OpenRouter DeepSeek V4.1 Flash 1017Isolated localopencode · openrouter/deepseek/deepseek-v4.1-flash-1017
Overall failed · No behavioral checks recorded

candidate failure

Timed out waiting for initial identity response; the observed state did not satisfy the condition. See the saved state evidence.
Test detailsNo checks recorded · 2m 49s
TokensUnavailable in · Unavailable outUnavailable cached · 0/1 runs covered
LLM spendUnavailable0/1 runs provider-priced
ExecutionLocal · not metered2m 33s agent

Worker phase timing: not captured.

Feedback was not captured for this attempt.

chat-features.runner-opencode.local.companies.archive-company
Attempt
1
Duration
2m 49s
Agent runtime
2m 33s
Runtime
native
Provider
opencode
Model
openrouter/deepseek/deepseek-v4.1-flash-1017

No result artifact was uploaded

Startup reuse evidence
RunWarmthEnvironment/leaseWorkspaceRunnerProvider processProvider sessionProvider launches
f284d0f4-6bca-4a11-be52-300b0ea3025eunknown unknown (evidence_missing)unknown (evidence_missing)unknown (evidence_missing)unknown (evidence_missing)unknown (evidence_missing) unknown

No matcher result was recorded.

Usage, billing and timing metadata
{
  "billing": {
    "llm": {
      "runCount": 1,
      "runsWithTokenUsage": 0,
      "runsWithReportedCost": 0,
      "runsWithEstimatedCost": 0,
      "runsWithPartialReportedCost": 0,
      "inputTokens": 79801,
      "outputTokens": 3496,
      "cachedInputTokens": 610432,
      "totalTokens": 693729,
      "reportedCostUsd": 0,
      "estimatedCostUsd": 0,
      "costStatus": "unavailable"
    },
    "runtime": {
      "provider": "local",
      "agentRunDurationMs": 153178,
      "leaseDurationMs": null,
      "leaseCount": 0,
      "costStatus": "not_metered",
      "costSource": "local_not_metered"
    },
    "reportedCostUsd": 0,
    "estimatedRuntimeCostUsd": 0,
    "observedAndEstimatedCostUsd": 0,
    "complete": false
  },
  "rawUsage": null,
  "workerTiming": null
}